BDBM31168 pyridopyrazinone, 22
SMILES: Oc1cc2nccnc2[nH]c1=O
InChI Key: InChIKey=YXJMWQZLHSAFLN-UHFFFAOYSA-N
Data: 2 IC50
Activity Spreadsheet -- Enzyme Inhibition Constant Data from BindingDB
Found 2 hits for monomerid = 31168
Trg + Lig
Ki
nM
ΔG°
kcal/mole
IC50
nM
Kd
nM
EC50/IC50
nM
koff
s-1
kon
M-1s-1
pHTemp
°C
D-aspartate oxidase
(Homo sapiens (Human))
BDBM31168
(pyridopyrazinone, 22)
Show SMILES Oc1cc2nccnc2[nH]c1=O
Show InChI InChI=1S/C7H5N3O2/c11-5-3-4-6(10-7(5)12)9-2-1-8-4/h1-3,11H,(H,9,10,12)
n/an/a>5.00E+4n/an/an/an/an/an/a
Pfizer
Assay Description
Inhibitory effect of compounds was determined in a cell free fluorescence assay. The H2O2 generated from the degradation of D-aspartic acid was linke...
J Med Chem 52: 3576-85 (2009)
Article DOI: 10.1021/jm900128w
BindingDB Entry DOI: 10.7270/Q2CZ35HM
D-amino-acid oxidase
(Homo sapiens (Human))
BDBM31168
(pyridopyrazinone, 22)
Show SMILES Oc1cc2nccnc2[nH]c1=O
Show InChI InChI=1S/C7H5N3O2/c11-5-3-4-6(10-7(5)12)9-2-1-8-4/h1-3,11H,(H,9,10,12)
Reactome pathway
n/an/a>5.00E+4n/an/an/an/a8.522
Pfizer
Assay Description
Inhibitory effect of compounds was determined in a cell free fluorescence assay. The H2O2 generated from the degradation of D-serine was linked to ox...
J Med Chem 52: 3576-85 (2009)
Article DOI: 10.1021/jm900128w
BindingDB Entry DOI: 10.7270/Q2CZ35HM