null
SMILES: Cc1cc(cc2cn[nH]c12)-c1c(ccn2nc(nc12)C1CC1)-c1ccc(F)cc1
InChI Key: InChIKey=CWEYUTZTXLDDJA-UHFFFAOYSA-N
Activity Spreadsheet -- Enzyme Inhibition Constant Data from BindingDB
Found 1 hit for monomerid = 311810
Trg + Lig
Ki
nM
ΔG°
kcal/mole
IC50
nM
Kd
nM
EC50/IC50
nM
koff
s-1
kon
M-1s-1
pHTemp
°C
Voltage-dependent calcium channel gamma-2 subunit
(Homo sapiens (Human))
BDBM311810
(2-Cyclopropyl-7-(4-fluorophenyl)-8-(7-methyl-1H-in...)
Show SMILES Cc1cc(cc2cn[nH]c12)-c1c(ccn2nc(nc12)C1CC1)-c1ccc(F)cc1
Show InChI InChI=1S/C23H18FN5/c1-13-10-16(11-17-12-25-27-21(13)17)20-19(14-4-6-18(24)7-5-14)8-9-29-23(20)26-22(28-29)15-2-3-15/h4-12,15H,2-3H2,1H3,(H,25,27)
US Patent
n/an/a 0.0790n/an/an/an/an/an/a
Janssen Pharmaceutica NV
US Patent
Assay Description
An in vitro assay was used to determine the potency of test compounds as inhibitors of the glutamate response of the channel formed by GluA1o-γ8...
US Patent US10155769 (2018)
BindingDB Entry DOI: 10.7270/Q2SB47TC