null
SMILES: Cc1nnc(c2ccccc12)C(C)(C)NC(=O)[C@@H]1[C@H]2CNC[C@@H]12
InChI Key: InChIKey=YKZSNIFYTODXNH-FICVDOATSA-N
Activity Spreadsheet -- Enzyme Inhibition Constant Data from BindingDB
Found 2 hits for monomerid = 311941
Trg + Lig
Ki
nM
ΔG°
kcal/mole
IC50
nM
Kd
nM
EC50/IC50
nM
koff
s-1
kon
M-1s-1
pHTemp
°C
Somatostatin receptor type 4
(Homo sapiens (Human))
BDBM311941
(US10166214, Example 77 | US10675268, Example 77)
Show SMILES Cc1nnc(c2ccccc12)C(C)(C)NC(=O)[C@@H]1[C@H]2CNC[C@@H]12 |r|
Show InChI InChI=1S/C18H22N4O/c1-10-11-6-4-5-7-12(11)16(22-21-10)18(2,3)20-17(23)15-13-8-19-9-14(13)15/h4-7,13-15,19H,8-9H2,1-3H3,(H,20,23)/t13-,14+,15+
US Patent
n/an/an/an/a 0.5n/an/an/an/a
Centrexion Therapeutics Corporation
US Patent
Assay Description
The activation of the SSTR4 receptor (Gi coupled) causes an inhibition of intracellular cAMP after stimulation with Forskolin, which can be quantifia...
US Patent US10675268 (2020)
BindingDB Entry DOI: 10.7270/Q21C20XK
Somatostatin receptor type 4
(Homo sapiens (Human))
BDBM311941
(US10166214, Example 77 | US10675268, Example 77)
Show SMILES Cc1nnc(c2ccccc12)C(C)(C)NC(=O)[C@@H]1[C@H]2CNC[C@@H]12 |r|
Show InChI InChI=1S/C18H22N4O/c1-10-11-6-4-5-7-12(11)16(22-21-10)18(2,3)20-17(23)15-13-8-19-9-14(13)15/h4-7,13-15,19H,8-9H2,1-3H3,(H,20,23)/t13-,14+,15+
US Patent
n/an/an/an/a 0.5n/an/an/an/a
Centrexion Therapeutics Corporation
US Patent
Assay Description
The activation of the SSTR4 receptor (Gi coupled) causes an inhibition of intracellular cAMP after stimulation with Forskolin, which can be quantifia...
US Patent US10166214 (2019)
BindingDB Entry DOI: 10.7270/Q2D50Q16