null
SMILES: CC(C)(NC(=O)[C@@H]1[C@H]2CNC[C@@H]12)c1nc(C2CC2)c2c(F)cccn12
InChI Key: InChIKey=WJUANPKZTBQLFB-IMRBUKKESA-N
Activity Spreadsheet -- Enzyme Inhibition Constant Data from BindingDB
Found 2 hits for monomerid = 312013
Trg + Lig
Ki
nM
ΔG°
kcal/mole
IC50
nM
Kd
nM
EC50/IC50
nM
koff
s-1
kon
M-1s-1
pHTemp
°C
Somatostatin receptor type 4
(Homo sapiens (Human))
BDBM312013
(US10166214, Example 149 | US10675268, Example 149)
Show SMILES CC(C)(NC(=O)[C@@H]1[C@H]2CNC[C@@H]12)c1nc(C2CC2)c2c(F)cccn12 |r|
Show InChI InChI=1S/C19H23FN4O/c1-19(2,23-17(25)14-11-8-21-9-12(11)14)18-22-15(10-5-6-10)16-13(20)4-3-7-24(16)18/h3-4,7,10-12,14,21H,5-6,8-9H2,1-2H3,(H,23,25)/t11-,12+,14+
US Patent
n/an/an/an/a 1n/an/an/an/a
Centrexion Therapeutics Corporation
US Patent
Assay Description
The activation of the SSTR4 receptor (Gi coupled) causes an inhibition of intracellular cAMP after stimulation with Forskolin, which can be quantifia...
US Patent US10675268 (2020)
BindingDB Entry DOI: 10.7270/Q21C20XK
Somatostatin receptor type 4
(Homo sapiens (Human))
BDBM312013
(US10166214, Example 149 | US10675268, Example 149)
Show SMILES CC(C)(NC(=O)[C@@H]1[C@H]2CNC[C@@H]12)c1nc(C2CC2)c2c(F)cccn12 |r|
Show InChI InChI=1S/C19H23FN4O/c1-19(2,23-17(25)14-11-8-21-9-12(11)14)18-22-15(10-5-6-10)16-13(20)4-3-7-24(16)18/h3-4,7,10-12,14,21H,5-6,8-9H2,1-2H3,(H,23,25)/t11-,12+,14+
US Patent
n/an/an/an/a 1n/an/an/an/a
Centrexion Therapeutics Corporation
US Patent
Assay Description
The activation of the SSTR4 receptor (Gi coupled) causes an inhibition of intracellular cAMP after stimulation with Forskolin, which can be quantifia...
US Patent US10166214 (2019)
BindingDB Entry DOI: 10.7270/Q2D50Q16