null
SMILES: Cc1nc(n2cccc(F)c12)C(C)(C)NC(=O)[C@@H]1[C@H]2CNC[C@@H]12
InChI Key: InChIKey=NBFWKXAOLPGVBG-PJXYFTJBSA-N
Activity Spreadsheet -- Enzyme Inhibition Constant Data from BindingDB
Found 2 hits for monomerid = 312015
Trg + Lig
Ki
nM
ΔG°
kcal/mole
IC50
nM
Kd
nM
EC50/IC50
nM
koff
s-1
kon
M-1s-1
pHTemp
°C
Somatostatin receptor type 4
(Homo sapiens (Human))
BDBM312015
(US10166214, Example 151 | US10675268, Example 151)
Show SMILES Cc1nc(n2cccc(F)c12)C(C)(C)NC(=O)[C@@H]1[C@H]2CNC[C@@H]12 |r|
Show InChI InChI=1S/C17H21FN4O/c1-9-14-12(18)5-4-6-22(14)16(20-9)17(2,3)21-15(23)13-10-7-19-8-11(10)13/h4-6,10-11,13,19H,7-8H2,1-3H3,(H,21,23)/t10-,11+,13+
US Patent
n/an/an/an/a 0.600n/an/an/an/a
Centrexion Therapeutics Corporation
US Patent
Assay Description
The activation of the SSTR4 receptor (Gi coupled) causes an inhibition of intracellular cAMP after stimulation with Forskolin, which can be quantifia...
US Patent US10675268 (2020)
Somatostatin receptor type 4
(Homo sapiens (Human))
BDBM312015
(US10166214, Example 151 | US10675268, Example 151)
Show SMILES Cc1nc(n2cccc(F)c12)C(C)(C)NC(=O)[C@@H]1[C@H]2CNC[C@@H]12 |r|
Show InChI InChI=1S/C17H21FN4O/c1-9-14-12(18)5-4-6-22(14)16(20-9)17(2,3)21-15(23)13-10-7-19-8-11(10)13/h4-6,10-11,13,19H,7-8H2,1-3H3,(H,21,23)/t10-,11+,13+
US Patent
n/an/an/an/a 0.600n/an/an/an/a
Centrexion Therapeutics Corporation
US Patent
Assay Description
The activation of the SSTR4 receptor (Gi coupled) causes an inhibition of intracellular cAMP after stimulation with Forskolin, which can be quantifia...
US Patent US10166214 (2019)
BindingDB Entry DOI: 10.7270/Q2D50Q16