null
SMILES: CCn1cc(NC(=O)c2cnn3ccc(N[C@@H]4CCCC[C@@H]4N)nc23)c(n1)C(N)=O
InChI Key: InChIKey=QRQXDUOVUWAHCZ-QWHCGFSZSA-N
Activity Spreadsheet -- Enzyme Inhibition Constant Data from BindingDB
Found 1 hit for monomerid = 312059
Trg + Lig
Ki
nM
ΔG°
kcal/mole
IC50
nM
Kd
nM
EC50/IC50
nM
koff
s-1
kon
M-1s-1
pHTemp
°C
Interleukin-1 receptor-associated kinase 4
(Homo sapiens (Human))
BDBM312059
(5-{[(1R,2S)-2-Aminocyclohexyl]amino}-N-(3-carbamoy...)
Show SMILES CCn1cc(NC(=O)c2cnn3ccc(N[C@@H]4CCCC[C@@H]4N)nc23)c(n1)C(N)=O |r|
Show InChI InChI=1S/C19H25N9O2/c1-2-27-10-14(16(26-27)17(21)29)24-19(30)11-9-22-28-8-7-15(25-18(11)28)23-13-6-4-3-5-12(13)20/h7-10,12-13H,2-6,20H2,1H3,(H2,21,29)(H,23,25)(H,24,30)/t12-,13+/m0/s1
Reactome pathway
US Patent
n/an/a 0.600n/an/an/an/an/an/a
Merck Sharp & Dohme Corp.
US Patent
Assay Description
The kinase activity of IRAK4 is determined by its ability to catalyze the phosphorylation of a fluorescent polypeptide substrate. The extent of phosp...
US Patent US10155765 (2018)
BindingDB Entry DOI: 10.7270/Q21V5H2J