BDBM31207 2-phenoxybenzoyltryptophan derivative, R1C1
SMILES: OC(=O)[C@H](Cc1c[nH]c2cc(Br)ccc12)NC(=O)c1ccccc1Oc1ccccc1
InChI Key: InChIKey=HUDCALMNDNWXIH-NRFANRHFSA-N
Data: 1 KI
Activity Spreadsheet -- Enzyme Inhibition Constant Data from BindingDB
Found 1 hit for monomerid = 31207
Trg + Lig
Ki
nM
ΔG°
kcal/mole
IC50
nM
Kd
nM
EC50/IC50
nM
koff
s-1
kon
M-1s-1
pHTemp
°C
E3 ubiquitin-protein ligase Mdm2
(Homo sapiens (Human))
BDBM31207
(2-phenoxybenzoyltryptophan derivative, R1C1)
Show SMILES OC(=O)[C@H](Cc1c[nH]c2cc(Br)ccc12)NC(=O)c1ccccc1Oc1ccccc1 |r|
Show InChI InChI=1S/C24H19BrN2O4/c25-16-10-11-18-15(14-26-20(18)13-16)12-21(24(29)30)27-23(28)19-8-4-5-9-22(19)31-17-6-2-1-3-7-17/h1-11,13-14,21,26H,12H2,(H,27,28)(H,29,30)/t21-/m0/s1
NCI pathway
Reactome pathway
3.00E+3 -7.48n/an/an/an/an/a7.423
Schering-Plough Research Institute
Assay Description
Ki values were determined from a competition experiment in which serial dilutions of inhibitor were added to compete against a fixed concentration (1...
Anal Biochem 331: 138-46 (2004)
Article DOI: 10.1016/j.ab.2004.03.009
BindingDB Entry DOI: 10.7270/Q2VX0DVV