BDBM31222 2-phenoxybenzoyltryptophan derivative, R4C4
SMILES: OC(=O)[C@H](Cc1cn(Cc2ccc(OCc3ccccc3)cc2)c2ccc(cc12)C#N)NC(=O)c1ccccc1Oc1ccccc1
InChI Key: InChIKey=AOWLHPAIWPBAAQ-DHUJRADRSA-N
Data: 1 KI
Activity Spreadsheet -- Enzyme Inhibition Constant Data from BindingDB
Found 1 hit for monomerid = 31222
Trg + Lig
Ki
nM
ΔG°
kcal/mole
IC50
nM
Kd
nM
EC50/IC50
nM
koff
s-1
kon
M-1s-1
pHTemp
°C
MDM2-MDMX
(Homo sapiens (Human))
BDBM31222
(2-phenoxybenzoyltryptophan derivative, R4C4)
Show SMILES OC(=O)[C@H](Cc1cn(Cc2ccc(OCc3ccccc3)cc2)c2ccc(cc12)C#N)NC(=O)c1ccccc1Oc1ccccc1 |r|
Show InChI InChI=1S/C39H31N3O5/c40-23-29-17-20-36-34(21-29)30(25-42(36)24-27-15-18-31(19-16-27)46-26-28-9-3-1-4-10-28)22-35(39(44)45)41-38(43)33-13-7-8-14-37(33)47-32-11-5-2-6-12-32/h1-21,25,35H,22,24,26H2,(H,41,43)(H,44,45)/t35-/m0/s1
NCI pathway
Reactome pathway
1.00E+3 -8.12n/an/an/an/an/a7.423
Schering-Plough Research Institute
Assay Description
Ki values were determined from a competition experiment in which serial dilutions of inhibitor were added to compete against a fixed concentration (1...
Anal Biochem 331: 138-46 (2004)
Article DOI: 10.1016/j.ab.2004.03.009
BindingDB Entry DOI: 10.7270/Q2VX0DVV