BDBM312244 1-[2-(Aminomethyl)-4-chlorobenzyl]-2-thioxo-1,2,3,5-tetrahydro-4H-pyrrolo[3,2-d]pyrimidin-4-one::US10016430, Example 7::US9616063, 7
SMILES: NCc1cc(Cl)ccc1Cn1c2cc[nH]c2c(=O)[nH]c1=S
InChI Key: InChIKey=MFCVOLWLNXXQFY-UHFFFAOYSA-N
Data: 6 IC50
Activity Spreadsheet -- Enzyme Inhibition Constant Data from BindingDB
Found 6 hits for monomerid = 312244
Trg + Lig
Ki
nM
ΔG°
kcal/mole
IC50
nM
Kd
nM
EC50/IC50
nM
koff
s-1
kon
M-1s-1
pHTemp
°C
Myeloperoxidase
(Homo sapiens (Human))
BDBM312244
(1-[2-(Aminomethyl)-4-chlorobenzyl]-2-thioxo-1,2,3,...)
Show SMILES NCc1cc(Cl)ccc1Cn1c2cc[nH]c2c(=O)[nH]c1=S |$;;;;;;;;;;;;;;HN;;;;;;$|
Show InChI InChI=1S/C14H13ClN4OS/c15-10-2-1-8(9(5-10)6-16)7-19-11-3-4-17-12(11)13(20)18-14(19)21/h1-5,17H,6-7,16H2,(H,18,20,21)
US Patent
n/an/a 15n/an/an/an/an/an/a
AstraZeneca AB
US Patent
Assay Description
The pharmacological activity of compounds disclosed herein was tested in the following screen (Test A) in which the compounds were tested in the pres...
US Patent US9616063 (2017)
BindingDB Entry DOI: 10.7270/Q2Q24296
Thyroid peroxidase
(Homo sapiens (Human))
BDBM312244
(1-[2-(Aminomethyl)-4-chlorobenzyl]-2-thioxo-1,2,3,...)
Show SMILES NCc1cc(Cl)ccc1Cn1c2cc[nH]c2c(=O)[nH]c1=S |$;;;;;;;;;;;;;;HN;;;;;;$|
Show InChI InChI=1S/C14H13ClN4OS/c15-10-2-1-8(9(5-10)6-16)7-19-11-3-4-17-12(11)13(20)18-14(19)21/h1-5,17H,6-7,16H2,(H,18,20,21)
US Patent
n/an/a 1.10E+4n/an/an/an/an/an/a
AstraZeneca AB
US Patent
Assay Description
To detect thyroid peroxidase (TPO) inhibitory activity, the production of hypoiodous acid (HOI) was quantified. HOI was detected by reacting it with ...
US Patent US9616063 (2017)
BindingDB Entry DOI: 10.7270/Q2Q24296
Thyroid peroxidase
(Homo sapiens (Human))
BDBM312244
(1-[2-(Aminomethyl)-4-chlorobenzyl]-2-thioxo-1,2,3,...)
Show SMILES NCc1cc(Cl)ccc1Cn1c2cc[nH]c2c(=O)[nH]c1=S |$;;;;;;;;;;;;;;HN;;;;;;$|
Show InChI InChI=1S/C14H13ClN4OS/c15-10-2-1-8(9(5-10)6-16)7-19-11-3-4-17-12(11)13(20)18-14(19)21/h1-5,17H,6-7,16H2,(H,18,20,21)
US Patent
n/an/a 1.10E+4n/an/an/an/an/an/a
ASTRAZENECA AB
US Patent
Assay Description
Methods for the determination of MPO inhibitory activity are disclosed in WO 02/090575. The pharmacological activity of compounds disclosed herein wa...
US Patent US11000525 (2021)
Thyroid peroxidase
(Homo sapiens (Human))
BDBM312244
(1-[2-(Aminomethyl)-4-chlorobenzyl]-2-thioxo-1,2,3,...)
Show SMILES NCc1cc(Cl)ccc1Cn1c2cc[nH]c2c(=O)[nH]c1=S |$;;;;;;;;;;;;;;HN;;;;;;$|
Show InChI InChI=1S/C14H13ClN4OS/c15-10-2-1-8(9(5-10)6-16)7-19-11-3-4-17-12(11)13(20)18-14(19)21/h1-5,17H,6-7,16H2,(H,18,20,21)
US Patent
n/an/a 1.10E+4n/an/an/an/an/an/a
AstraZeneca AB
US Patent
Assay Description
MPO: The pharmacological activity of compounds disclosed herein was tested in the following screen (Test A) in which the compounds were tested in the...
US Patent US10016430 (2018)
BindingDB Entry DOI: 10.7270/Q2WW7M2N
Myeloperoxidase
(Homo sapiens (Human))
BDBM312244
(1-[2-(Aminomethyl)-4-chlorobenzyl]-2-thioxo-1,2,3,...)
Show SMILES NCc1cc(Cl)ccc1Cn1c2cc[nH]c2c(=O)[nH]c1=S |$;;;;;;;;;;;;;;HN;;;;;;$|
Show InChI InChI=1S/C14H13ClN4OS/c15-10-2-1-8(9(5-10)6-16)7-19-11-3-4-17-12(11)13(20)18-14(19)21/h1-5,17H,6-7,16H2,(H,18,20,21)
US Patent
n/an/a 15n/an/an/an/an/an/a
ASTRAZENECA AB
US Patent
Assay Description
Methods for the determination of MPO inhibitory activity are disclosed in WO 02/090575. The pharmacological activity of compounds disclosed herein wa...
US Patent US11000525 (2021)
Myeloperoxidase
(Homo sapiens (Human))
BDBM312244
(1-[2-(Aminomethyl)-4-chlorobenzyl]-2-thioxo-1,2,3,...)
Show SMILES NCc1cc(Cl)ccc1Cn1c2cc[nH]c2c(=O)[nH]c1=S |$;;;;;;;;;;;;;;HN;;;;;;$|
Show InChI InChI=1S/C14H13ClN4OS/c15-10-2-1-8(9(5-10)6-16)7-19-11-3-4-17-12(11)13(20)18-14(19)21/h1-5,17H,6-7,16H2,(H,18,20,21)
US Patent
n/an/a 15n/an/an/an/an/an/a
AstraZeneca AB
US Patent
Assay Description
MPO: The pharmacological activity of compounds disclosed herein was tested in the following screen (Test A) in which the compounds were tested in the...
US Patent US10016430 (2018)
BindingDB Entry DOI: 10.7270/Q2WW7M2N