BDBM31225 2-phenoxybenzoyltryptophan derivative, R5C3
SMILES: Cc1ccc2n(cc(C[C@H](NC(=O)c3ccccc3Oc3ccccc3)C(O)=O)c2c1)C(=O)OCc1ccccc1
InChI Key: InChIKey=FHNQOOZTZWBWQO-NDEPHWFRSA-N
Data: 1 KI
Activity Spreadsheet -- Enzyme Inhibition Constant Data from BindingDB
Found 1 hit for monomerid = 31225
Trg + Lig
Ki
nM
ΔG°
kcal/mole
IC50
nM
Kd
nM
EC50/IC50
nM
koff
s-1
kon
M-1s-1
pHTemp
°C
MDM2-MDMX
(Homo sapiens (Human))
BDBM31225
(2-phenoxybenzoyltryptophan derivative, R5C3)
Show SMILES Cc1ccc2n(cc(C[C@H](NC(=O)c3ccccc3Oc3ccccc3)C(O)=O)c2c1)C(=O)OCc1ccccc1 |r|
Show InChI InChI=1S/C33H28N2O6/c1-22-16-17-29-27(18-22)24(20-35(29)33(39)40-21-23-10-4-2-5-11-23)19-28(32(37)38)34-31(36)26-14-8-9-15-30(26)41-25-12-6-3-7-13-25/h2-18,20,28H,19,21H2,1H3,(H,34,36)(H,37,38)/t28-/m0/s1
NCI pathway
Reactome pathway
100 -9.48n/an/an/an/an/a7.423
Schering-Plough Research Institute
Assay Description
Ki values were determined from a competition experiment in which serial dilutions of inhibitor were added to compete against a fixed concentration (1...
Anal Biochem 331: 138-46 (2004)
Article DOI: 10.1016/j.ab.2004.03.009
BindingDB Entry DOI: 10.7270/Q2VX0DVV