BDBM313052 N-{2-[(4aR,6S,8aR)-2-amino-6-methyl-4,4a,5,6-tetrahydropyrano[3,4-d][1,3]thiazin-8a(8H)-yl]-1,3-thiazol-4-yl}-1-cyanocyclobutanecarboxamide::US9605007, Example 108::US9744173, Example 108
SMILES: C[C@H]1C[C@H]2CSC(N)=N[C@]2(CO1)c1nc(NC(=O)C2(CCC2)C#N)cs1
InChI Key: InChIKey=XZKSIVHILMPFLG-DINDLPBHSA-N
Data: 2 IC50
Activity Spreadsheet -- Enzyme Inhibition Constant Data from BindingDB
Found 2 hits for monomerid = 313052
Trg + Lig
Ki
nM
ΔG°
kcal/mole
IC50
nM
Kd
nM
EC50/IC50
nM
koff
s-1
kon
M-1s-1
pHTemp
°C
Beta-secretase 1
(Homo sapiens (Human))
BDBM313052
(N-{2-[(4aR,6S,8aR)-2-amino-6-methyl-4,4a,5,6-tetra...)
Show SMILES C[C@H]1C[C@H]2CSC(N)=N[C@]2(CO1)c1nc(NC(=O)C2(CCC2)C#N)cs1 |c:7|
Show InChI InChI=1S/C17H21N5O2S2/c1-10-5-11-6-26-15(19)22-17(11,9-24-10)14-21-12(7-25-14)20-13(23)16(8-18)3-2-4-16/h7,10-11H,2-6,9H2,1H3,(H2,19,22)(H,20,23)/t10-,11-,17-/m0/s1
US Patent
n/an/a 94n/an/an/an/an/an/a
Pfizer Inc.
US Patent
Assay Description
Beta-secretase (BACE) is one of the enzymes involved in the generation of the amyloid beta peptide found in the amyloid plaques of Alzheimer's Di...
US Patent US9744173 (2017)
BindingDB Entry DOI: 10.7270/Q2K076CZ
Beta-secretase 1
(Homo sapiens (Human))
BDBM313052
(N-{2-[(4aR,6S,8aR)-2-amino-6-methyl-4,4a,5,6-tetra...)
Show SMILES C[C@H]1C[C@H]2CSC(N)=N[C@]2(CO1)c1nc(NC(=O)C2(CCC2)C#N)cs1 |c:7|
Show InChI InChI=1S/C17H21N5O2S2/c1-10-5-11-6-26-15(19)22-17(11,9-24-10)14-21-12(7-25-14)20-13(23)16(8-18)3-2-4-16/h7,10-11H,2-6,9H2,1H3,(H2,19,22)(H,20,23)/t10-,11-,17-/m0/s1
US Patent
n/an/a 94n/an/an/an/an/an/a
Pfizer Inc.
US Patent
Assay Description
Beta-secretase (BACE) is one of the enzymes involved in the generation of the amyloid beta peptide found in the amyloid plaques of Alzheimer's Di...
US Patent US9605007 (2017)
BindingDB Entry DOI: 10.7270/Q2JQ133S