null
SMILES: CCC\C=C/COC[C@@H]1CCc2cc(ccc2C1)[C@H]1CC[C@](N)(COP(O)(O)=O)C1
InChI Key: InChIKey=HOIPQWAGBHAJRQ-JXMKDMJNSA-N
Activity Spreadsheet -- Enzyme Inhibition Constant Data from BindingDB
Found 4 hits for monomerid = 313232
Trg + Lig
Ki
nM
ΔG°
kcal/mole
IC50
nM
Kd
nM
EC50/IC50
nM
koff
s-1
kon
M-1s-1
pHTemp
°C
Sphingosine-1-phosphate lyase 1
(Homo sapiens (Human))
BDBM313232
(US10166249, Example 462)
Show SMILES CCC\C=C/COC[C@@H]1CCc2cc(ccc2C1)[C@H]1CC[C@](N)(COP(O)(O)=O)C1 |r|
Show InChI InChI=1S/C23H36NO5P/c1-2-3-4-5-12-28-16-18-6-7-20-14-21(9-8-19(20)13-18)22-10-11-23(24,15-22)17-29-30(25,26)27/h4-5,8-9,14,18,22H,2-3,6-7,10-13,15-17,24H2,1H3,(H2,25,26,27)/b5-4-/t18-,22+,23-/m1/s1
US Patent
n/an/a<10n/an/an/an/an/an/a
Bristol-Myers Squibb Company
US Patent
Assay Description
Membranes were prepared from CHO cells expressing human S1P1. Cells pellets (1×109 cells/pellet) were suspended in buffer containing 20 mM HEPES (4-(...
US Patent US10166249 (2019)
BindingDB Entry DOI: 10.7270/Q2S75JCM
Sphingosine 1-phosphate receptor 3
(Homo sapiens (Human))
BDBM313232
(US10166249, Example 462)
Show SMILES CCC\C=C/COC[C@@H]1CCc2cc(ccc2C1)[C@H]1CC[C@](N)(COP(O)(O)=O)C1 |r|
Show InChI InChI=1S/C23H36NO5P/c1-2-3-4-5-12-28-16-18-6-7-20-14-21(9-8-19(20)13-18)22-10-11-23(24,15-22)17-29-30(25,26)27/h4-5,8-9,14,18,22H,2-3,6-7,10-13,15-17,24H2,1H3,(H2,25,26,27)/b5-4-/t18-,22+,23-/m1/s1
NCI pathway
Reactome pathway
US Patent
n/an/an/an/a>50n/an/an/an/a
Bristol-Myers Squibb Company
US Patent
Assay Description
Compounds were loaded in a 384 Falcon v-bottom plate (0.5 l/well in a 11 point, 3-fold dilution). Membranes prepared from S1P1/CHO cells or EDG3-Gal5...
US Patent US10166249 (2019)
BindingDB Entry DOI: 10.7270/Q2S75JCM
Sphingosine-1-phosphate lyase 1
(Homo sapiens (Human))
BDBM313232
(US10166249, Example 462)
Show SMILES CCC\C=C/COC[C@@H]1CCc2cc(ccc2C1)[C@H]1CC[C@](N)(COP(O)(O)=O)C1 |r|
Show InChI InChI=1S/C23H36NO5P/c1-2-3-4-5-12-28-16-18-6-7-20-14-21(9-8-19(20)13-18)22-10-11-23(24,15-22)17-29-30(25,26)27/h4-5,8-9,14,18,22H,2-3,6-7,10-13,15-17,24H2,1H3,(H2,25,26,27)/b5-4-/t18-,22+,23-/m1/s1
US Patent
n/an/an/an/a<10n/an/an/an/a
Bristol-Myers Squibb Company
US Patent
Assay Description
hS1P1/CHO cells were plated into BD Amine 384-well plates the day before the assay. On the day of the assay, growth medium was removed and replaced w...
US Patent US10166249 (2019)
BindingDB Entry DOI: 10.7270/Q2S75JCM
Sphingosine-1-phosphate lyase 1
(Homo sapiens (Human))
BDBM313232
(US10166249, Example 462)
Show SMILES CCC\C=C/COC[C@@H]1CCc2cc(ccc2C1)[C@H]1CC[C@](N)(COP(O)(O)=O)C1 |r|
Show InChI InChI=1S/C23H36NO5P/c1-2-3-4-5-12-28-16-18-6-7-20-14-21(9-8-19(20)13-18)22-10-11-23(24,15-22)17-29-30(25,26)27/h4-5,8-9,14,18,22H,2-3,6-7,10-13,15-17,24H2,1H3,(H2,25,26,27)/b5-4-/t18-,22+,23-/m1/s1
US Patent
n/an/an/an/a<10n/an/an/an/a
Bristol-Myers Squibb Company
US Patent
Assay Description
Compounds were loaded in a 384 Falcon v-bottom plate (0.5 l/well in a 11 point, 3-fold dilution). Membranes prepared from S1P1/CHO cells or EDG3-Gal5...
US Patent US10166249 (2019)
BindingDB Entry DOI: 10.7270/Q2S75JCM