null
SMILES: N[C@]1(COP(O)(O)=O)CC[C@@H](C1)c1ccc2C[C@@H](CCc2c1)OCCOCc1ccccc1
InChI Key: InChIKey=FOMGAUDOIMNPFJ-ISJGIBHGSA-N
Activity Spreadsheet -- Enzyme Inhibition Constant Data from BindingDB
Found 3 hits for monomerid = 313347
Trg + Lig
Ki
nM
ΔG°
kcal/mole
IC50
nM
Kd
nM
EC50/IC50
nM
koff
s-1
kon
M-1s-1
pHTemp
°C
Sphingosine-1-phosphate lyase 1
(Homo sapiens (Human))
BDBM313347
(US10166249, Example 581)
Show SMILES N[C@]1(COP(O)(O)=O)CC[C@@H](C1)c1ccc2C[C@@H](CCc2c1)OCCOCc1ccccc1 |r|
Show InChI InChI=1S/C25H34NO6P/c26-25(18-32-33(27,28)29)11-10-23(16-25)21-6-7-22-15-24(9-8-20(22)14-21)31-13-12-30-17-19-4-2-1-3-5-19/h1-7,14,23-24H,8-13,15-18,26H2,(H2,27,28,29)/t23-,24+,25+/m0/s1
US Patent
n/an/a<10n/an/an/an/an/an/a
Bristol-Myers Squibb Company
US Patent
Assay Description
Membranes were prepared from CHO cells expressing human S1P1. Cells pellets (1×109 cells/pellet) were suspended in buffer containing 20 mM HEPES (4-(...
US Patent US10166249 (2019)
BindingDB Entry DOI: 10.7270/Q2S75JCM
Sphingosine 1-phosphate receptor 3
(Homo sapiens (Human))
BDBM313347
(US10166249, Example 581)
Show SMILES N[C@]1(COP(O)(O)=O)CC[C@@H](C1)c1ccc2C[C@@H](CCc2c1)OCCOCc1ccccc1 |r|
Show InChI InChI=1S/C25H34NO6P/c26-25(18-32-33(27,28)29)11-10-23(16-25)21-6-7-22-15-24(9-8-20(22)14-21)31-13-12-30-17-19-4-2-1-3-5-19/h1-7,14,23-24H,8-13,15-18,26H2,(H2,27,28,29)/t23-,24+,25+/m0/s1
NCI pathway
Reactome pathway
US Patent
n/an/an/an/a>625n/an/an/an/a
Bristol-Myers Squibb Company
US Patent
Assay Description
Compounds were loaded in a 384 Falcon v-bottom plate (0.5 l/well in a 11 point, 3-fold dilution). Membranes prepared from S1P1/CHO cells or EDG3-Gal5...
US Patent US10166249 (2019)
BindingDB Entry DOI: 10.7270/Q2S75JCM
Sphingosine-1-phosphate lyase 1
(Homo sapiens (Human))
BDBM313347
(US10166249, Example 581)
Show SMILES N[C@]1(COP(O)(O)=O)CC[C@@H](C1)c1ccc2C[C@@H](CCc2c1)OCCOCc1ccccc1 |r|
Show InChI InChI=1S/C25H34NO6P/c26-25(18-32-33(27,28)29)11-10-23(16-25)21-6-7-22-15-24(9-8-20(22)14-21)31-13-12-30-17-19-4-2-1-3-5-19/h1-7,14,23-24H,8-13,15-18,26H2,(H2,27,28,29)/t23-,24+,25+/m0/s1
US Patent
n/an/an/an/a<10n/an/an/an/a
Bristol-Myers Squibb Company
US Patent
Assay Description
Compounds were loaded in a 384 Falcon v-bottom plate (0.5 l/well in a 11 point, 3-fold dilution). Membranes prepared from S1P1/CHO cells or EDG3-Gal5...
US Patent US10166249 (2019)
BindingDB Entry DOI: 10.7270/Q2S75JCM