BDBM313767 US10167285, Example 12
SMILES: COc1ccc(I)c(CC2Nc3cnc(F)nc3N2CCCC#C)c1OC
InChI Key: InChIKey=CYOIYVKTJLSVDY-UHFFFAOYSA-N
Data: 2 IC50  1 EC50
Activity Spreadsheet -- Enzyme Inhibition Constant Data from BindingDB
Found 3 hits for monomerid = 313767
Trg + Lig
Ki
nM
ΔG°
kcal/mole
IC50
nM
Kd
nM
EC50/IC50
nM
koff
s-1
kon
M-1s-1
pHTemp
°C
Heat shock protein HSP 90-alpha
(Homo sapiens (Human))
BDBM313767
(US10167285, Example 12)
Show SMILES COc1ccc(I)c(CC2Nc3cnc(F)nc3N2CCCC#C)c1OC
Show InChI InChI=1S/C19H20FIN4O2/c1-4-5-6-9-25-16(23-14-11-22-19(20)24-18(14)25)10-12-13(21)7-8-15(26-2)17(12)27-3/h1,7-8,11,16,23H,5-6,9-10H2,2-3H3
NCI pathway
Reactome pathway
US Patent
n/an/an/an/a>1.50E+4n/an/an/an/a
Memorial Sloan Kettering Cancer Center
US Patent
Assay Description
The biochemical assay tests competitive binding of compounds to recombinant Hsp90α protein and also Hsp90 found in cell specific complexes, and ...
US Patent US10167285 (2019)
BindingDB Entry DOI: 10.7270/Q2BZ684R
Receptor tyrosine-protein kinase erbB-2
(Homo sapiens (Human))
BDBM313767
(US10167285, Example 12)
Show SMILES COc1ccc(I)c(CC2Nc3cnc(F)nc3N2CCCC#C)c1OC
Show InChI InChI=1S/C19H20FIN4O2/c1-4-5-6-9-25-16(23-14-11-22-19(20)24-18(14)25)10-12-13(21)7-8-15(26-2)17(12)27-3/h1,7-8,11,16,23H,5-6,9-10H2,2-3H3
US Patent
n/an/a>5.00E+4n/an/an/an/an/an/a
Memorial Sloan Kettering Cancer Center
US Patent
US Patent US10167285 (2019)
BindingDB Entry DOI: 10.7270/Q2BZ684R
Receptor tyrosine-protein kinase erbB-2
(Homo sapiens (Human))
BDBM313767
(US10167285, Example 12)
Show SMILES COc1ccc(I)c(CC2Nc3cnc(F)nc3N2CCCC#C)c1OC
Show InChI InChI=1S/C19H20FIN4O2/c1-4-5-6-9-25-16(23-14-11-22-19(20)24-18(14)25)10-12-13(21)7-8-15(26-2)17(12)27-3/h1,7-8,11,16,23H,5-6,9-10H2,2-3H3
US Patent
n/an/a>5.00E+4n/an/an/an/an/an/a
Memorial Sloan Kettering Cancer Center
US Patent
US Patent US10167285 (2019)
BindingDB Entry DOI: 10.7270/Q2BZ684R