BDBM313857 US10167293, Example 49
SMILES: CCc1ccc(cc1)S(=O)(=O)N1C2CCC1CN(C2)C(=O)c1cnn[nH]1
InChI Key:
Data: 1 IC50
Activity Spreadsheet -- Enzyme Inhibition Constant Data from BindingDB
Found 1 hit for monomerid = 313857
Trg + Lig
Ki
nM
ΔG°
kcal/mole
IC50
nM
Kd
nM
EC50/IC50
nM
koff
s-1
kon
M-1s-1
pHTemp
°C
Aldo-keto reductase family 1 member C3
(Homo sapiens (Human))
BDBM313857
(US10167293, Example 49)
Show SMILES CCc1ccc(cc1)S(=O)(=O)N1C2CCC1CN(C2)C(=O)c1cnn[nH]1
US Patent
n/an/a 1.20n/an/an/an/an/an/a
BAYER PHARMA AKTIENGESELLSCHAFT
US Patent
Assay Description
The enzyme used was recombinant human AKR1C3 (Aldo-keto reductase family 1 member C3; GenBank Accession No. NM_003739). This was expressed in E. coli...
US Patent US10167293 (2019)
BindingDB Entry DOI: 10.7270/Q23J3G1F