BDBM314072 US9610264, Compound 8
SMILES: CC(C)C(=O)Cc1cccc(c1)C(=O)Nc1ccccc1C(=O)NCc1ccccc1
InChI Key: InChIKey=RRBVGMXLNKTWFS-UHFFFAOYSA-N
Data: 1 IC50
Activity Spreadsheet -- Enzyme Inhibition Constant Data from BindingDB
Found 1 hit for monomerid = 314072
Trg + Lig
Ki
nM
ΔG°
kcal/mole
IC50
nM
Kd
nM
EC50/IC50
nM
koff
s-1
kon
M-1s-1
pHTemp
°C
Integrin α4β7
(Homo sapiens (Human))
BDBM314072
(US9610264, Compound 8)
Show SMILES CC(C)C(=O)Cc1cccc(c1)C(=O)Nc1ccccc1C(=O)NCc1ccccc1
Show InChI InChI=1S/C26H26N2O3/c1-18(2)24(29)16-20-11-8-12-21(15-20)25(30)28-23-14-7-6-13-22(23)26(31)27-17-19-9-4-3-5-10-19/h3-15,18H,16-17H2,1-2H3,(H,27,31)(H,28,30)
NCI pathway
Reactome pathway
US Patent
n/an/a 1.23n/an/an/an/an/an/a
KFLP BIOTECH, LLC
US Patent
Assay Description
The studies began by screening for the optimal protein concentrations for the method. The studies were conducted in goat anti-mouse IgG coated black ...
US Patent US9610264 (2017)
BindingDB Entry DOI: 10.7270/Q2KH0QD4