BDBM31412 terphenyl scaffold, 20
SMILES: Cc1cc(CCC(O)=O)ccc1-c1cc(C)c(c(C)c1)-c1ccc(OCC(O)=O)c(Cc2ccccc2)c1
InChI Key: InChIKey=AHBDZAABYGXHOP-UHFFFAOYSA-N
Data: 1 KI
Activity Spreadsheet -- Enzyme Inhibition Constant Data from BindingDB
Found 1 hit for monomerid = 31412
Trg + Lig
Ki
nM
ΔG°
kcal/mole
IC50
nM
Kd
nM
EC50/IC50
nM
koff
s-1
kon
M-1s-1
pHTemp
°C
Bcl-2-like protein 1
(Homo sapiens (Human))
BDBM31412
(terphenyl scaffold, 20)
Show SMILES Cc1cc(CCC(O)=O)ccc1-c1cc(C)c(c(C)c1)-c1ccc(OCC(O)=O)c(Cc2ccccc2)c1
Show InChI InChI=1S/C33H32O5/c1-21-15-25(10-14-31(34)35)9-12-29(21)27-16-22(2)33(23(3)17-27)26-11-13-30(38-20-32(36)37)28(19-26)18-24-7-5-4-6-8-24/h4-9,11-13,15-17,19H,10,14,18,20H2,1-3H3,(H,34,35)(H,36,37)
NCI pathway
Reactome pathway
2.34E+3 -7.68n/an/an/an/an/a7.425
Yale University
Assay Description
Fluorescence polarization experiments were conducted on a Photon Technology International instrument using a 0.3 cm path length cuvette. Spectra were...
J Am Chem Soc 127: 10191-6 (2005)
Article DOI: 10.1021/ja050122x
BindingDB Entry DOI: 10.7270/Q2668BHF