BDBM31536 pyrazolo[4,3-h]quinazoline-3-carboxamide, 19
SMILES: Cn1nc(C(=O)NC2CCCC2)c2CCc3cnc(Nc4ccccc4)nc3-c12
InChI Key: InChIKey=JBZSHFMYVGCDBI-UHFFFAOYSA-N
Data: 5 IC50
Activity Spreadsheet -- Enzyme Inhibition Constant Data from BindingDB
Found 5 hits for monomerid = 31536
Trg + Lig
Ki
nM
ΔG°
kcal/mole
IC50
nM
Kd
nM
EC50/IC50
nM
koff
s-1
kon
M-1s-1
pHTemp
°C
Cyclin-Dependent Kinase 2 (CDK2)
(Homo sapiens (Human))
BDBM31536
(pyrazolo[4,3-h]quinazoline-3-carboxamide, 19)
Show SMILES Cn1nc(C(=O)NC2CCCC2)c2CCc3cnc(Nc4ccccc4)nc3-c12
Show InChI InChI=1S/C22H24N6O/c1-28-20-17(19(27-28)21(29)24-15-9-5-6-10-15)12-11-14-13-23-22(26-18(14)20)25-16-7-3-2-4-8-16/h2-4,7-8,13,15H,5-6,9-12H2,1H3,(H,24,29)(H,23,25,26)
NCI pathway
Reactome pathway
n/an/a 3.90E+3n/an/an/an/a7.423
Nerviano Medical Sciences Srl
Assay Description
The biochemical activity of compounds was determined by incubation with specific enzymes and substrates, followed by quantitation of the phosphorylat...
J Med Chem 52: 5152-63 (2009)
Article DOI: 10.1021/jm9006559
BindingDB Entry DOI: 10.7270/Q2JH3JJP
Aurora kinase A
(Homo sapiens (Human))
BDBM31536
(pyrazolo[4,3-h]quinazoline-3-carboxamide, 19)
Show SMILES Cn1nc(C(=O)NC2CCCC2)c2CCc3cnc(Nc4ccccc4)nc3-c12
Show InChI InChI=1S/C22H24N6O/c1-28-20-17(19(27-28)21(29)24-15-9-5-6-10-15)12-11-14-13-23-22(26-18(14)20)25-16-7-3-2-4-8-16/h2-4,7-8,13,15H,5-6,9-12H2,1H3,(H,24,29)(H,23,25,26)
NCI pathway
Reactome pathway
n/an/a>1.00E+4n/an/an/an/an/a25
Nerviano Medical Sciences Srl
Assay Description
The biochemical activity of compounds was determined by incubation with specific enzymes and substrates, followed by quantitation of the phosphorylat...
J Med Chem 52: 5152-63 (2009)
Article DOI: 10.1021/jm9006559
BindingDB Entry DOI: 10.7270/Q2JH3JJP
Aurora kinase A
(Homo sapiens (Human))
BDBM31536
(pyrazolo[4,3-h]quinazoline-3-carboxamide, 19)
Show SMILES Cn1nc(C(=O)NC2CCCC2)c2CCc3cnc(Nc4ccccc4)nc3-c12
Show InChI InChI=1S/C22H24N6O/c1-28-20-17(19(27-28)21(29)24-15-9-5-6-10-15)12-11-14-13-23-22(26-18(14)20)25-16-7-3-2-4-8-16/h2-4,7-8,13,15H,5-6,9-12H2,1H3,(H,24,29)(H,23,25,26)
NCI pathway
Reactome pathway
n/an/a>1.00E+4n/an/an/an/an/an/a
Nerviano Medical Sciences Srl
Curated by ChEMBL
Assay Description
Inhibition of Aurora A assessed as [33P]gamma-ATP incorporation into substrate after 60 mins by gamma counting
J Med Chem 53: 3532-51 (2010)
Article DOI: 10.1021/jm901713n
BindingDB Entry DOI: 10.7270/Q2RF5V5D
Serine/threonine-protein kinase PLK1
(Homo sapiens (Human))
BDBM31536
(pyrazolo[4,3-h]quinazoline-3-carboxamide, 19)
Show SMILES Cn1nc(C(=O)NC2CCCC2)c2CCc3cnc(Nc4ccccc4)nc3-c12
Show InChI InChI=1S/C22H24N6O/c1-28-20-17(19(27-28)21(29)24-15-9-5-6-10-15)12-11-14-13-23-22(26-18(14)20)25-16-7-3-2-4-8-16/h2-4,7-8,13,15H,5-6,9-12H2,1H3,(H,24,29)(H,23,25,26)
NCI pathway
Reactome pathway
n/an/a>1.00E+4n/an/an/an/an/an/a
Nerviano Medical Sciences Srl
Curated by ChEMBL
Assay Description
Inhibition of GST-tagged PLK1 expressed in H5 insect cells assessed as [33P]gamma-ATP incorporation into substrate after 60 mins by gamma counting
J Med Chem 53: 3532-51 (2010)
Article DOI: 10.1021/jm901713n
BindingDB Entry DOI: 10.7270/Q2RF5V5D
CDK2/Cyclin A/Cyclin A1
(Homo sapiens (Human))
BDBM31536
(pyrazolo[4,3-h]quinazoline-3-carboxamide, 19)
Show SMILES Cn1nc(C(=O)NC2CCCC2)c2CCc3cnc(Nc4ccccc4)nc3-c12
Show InChI InChI=1S/C22H24N6O/c1-28-20-17(19(27-28)21(29)24-15-9-5-6-10-15)12-11-14-13-23-22(26-18(14)20)25-16-7-3-2-4-8-16/h2-4,7-8,13,15H,5-6,9-12H2,1H3,(H,24,29)(H,23,25,26)
Reactome pathway
n/an/a 3.90E+3n/an/an/an/an/an/a
Nerviano Medical Sciences Srl
Curated by ChEMBL
Assay Description
Inhibition of CDK2/Cyclin A assessed as [33P]gamma-ATP incorporation into substrate after 60 mins by gamma counting
J Med Chem 53: 3532-51 (2010)
Article DOI: 10.1021/jm901713n
BindingDB Entry DOI: 10.7270/Q2RF5V5D