BDBM315536 US10172858, Table 2.31::US9828378, # 31
SMILES: Nc1ncnc2n(nc(-c3cc4cc(O)ccc4[nH]3)c12)C1CCN(CC1)C(=O)C1CC1
InChI Key: InChIKey=ROGZIUMCYBBMQJ-UHFFFAOYSA-N
Data: 8 IC50
Activity Spreadsheet -- Enzyme Inhibition Constant Data from BindingDB
Found 8 hits for monomerid = 315536
Trg + Lig
Ki
nM
ΔG°
kcal/mole
IC50
nM
Kd
nM
EC50/IC50
nM
koff
s-1
kon
M-1s-1
pHTemp
°C
Serine/threonine-protein kinase mTOR
(Homo sapiens (Human))
BDBM315536
(US10172858, Table 2.31 | US9828378, # 31)
Show SMILES Nc1ncnc2n(nc(-c3cc4cc(O)ccc4[nH]3)c12)C1CCN(CC1)C(=O)C1CC1
Show InChI InChI=1S/C22H23N7O2/c23-20-18-19(17-10-13-9-15(30)3-4-16(13)26-17)27-29(21(18)25-11-24-20)14-5-7-28(8-6-14)22(31)12-1-2-12/h3-4,9-12,14,26,30H,1-2,5-8H2,(H2,23,24,25)
NCI pathway
Reactome pathway
US Patent
n/an/a<25n/an/an/an/an/an/a
INTELLIKINE LLC
US Patent
Assay Description
This assay is relatively simple, reasonably sensitive, and the peptide substrate can be adjusted both in terms of sequence and concentration to meet ...
US Patent US10172858 (2019)
BindingDB Entry DOI: 10.7270/Q2736T01
PI3-kinase class I
(Homo sapiens (Human))
BDBM315536
(US10172858, Table 2.31 | US9828378, # 31)
Show SMILES Nc1ncnc2n(nc(-c3cc4cc(O)ccc4[nH]3)c12)C1CCN(CC1)C(=O)C1CC1
Show InChI InChI=1S/C22H23N7O2/c23-20-18-19(17-10-13-9-15(30)3-4-16(13)26-17)27-29(21(18)25-11-24-20)14-5-7-28(8-6-14)22(31)12-1-2-12/h3-4,9-12,14,26,30H,1-2,5-8H2,(H2,23,24,25)
US Patent
n/an/a>500n/an/an/an/an/an/a
INTELLIKINE LLC
US Patent
Assay Description
This assay is relatively simple, reasonably sensitive, and the peptide substrate can be adjusted both in terms of sequence and concentration to meet ...
US Patent US10172858 (2019)
BindingDB Entry DOI: 10.7270/Q2736T01
Phosphatidylinositol 3-kinase regulatory subunit beta
(Homo sapiens (Human))
BDBM315536
(US10172858, Table 2.31 | US9828378, # 31)
Show SMILES Nc1ncnc2n(nc(-c3cc4cc(O)ccc4[nH]3)c12)C1CCN(CC1)C(=O)C1CC1
Show InChI InChI=1S/C22H23N7O2/c23-20-18-19(17-10-13-9-15(30)3-4-16(13)26-17)27-29(21(18)25-11-24-20)14-5-7-28(8-6-14)22(31)12-1-2-12/h3-4,9-12,14,26,30H,1-2,5-8H2,(H2,23,24,25)
NCI pathway
Reactome pathway
US Patent
n/an/a>500n/an/an/an/an/an/a
INTELLIKINE LLC
US Patent
Assay Description
This assay is relatively simple, reasonably sensitive, and the peptide substrate can be adjusted both in terms of sequence and concentration to meet ...
US Patent US10172858 (2019)
BindingDB Entry DOI: 10.7270/Q2736T01
Phosphatidylinositol 4,5-bisphosphate 3-kinase catalytic subunit delta isoform
(Homo sapiens (Human))
BDBM315536
(US10172858, Table 2.31 | US9828378, # 31)
Show SMILES Nc1ncnc2n(nc(-c3cc4cc(O)ccc4[nH]3)c12)C1CCN(CC1)C(=O)C1CC1
Show InChI InChI=1S/C22H23N7O2/c23-20-18-19(17-10-13-9-15(30)3-4-16(13)26-17)27-29(21(18)25-11-24-20)14-5-7-28(8-6-14)22(31)12-1-2-12/h3-4,9-12,14,26,30H,1-2,5-8H2,(H2,23,24,25)
NCI pathway
Reactome pathway
US Patent
n/an/a<500n/an/an/an/an/an/a
Intellikine LLC
US Patent
Assay Description
Class I PI3-Ks can be either purchased (p110α/p85α, p110β/p85α, p110δ/p85α from Upstate, and p110γ from Sigma) or...
US Patent US9828378 (2017)
BindingDB Entry DOI: 10.7270/Q2542QWN
Cytosolic arginine sensor for mTORC1 subunit 1
(Homo sapiens (Human))
BDBM315536
(US10172858, Table 2.31 | US9828378, # 31)
Show SMILES Nc1ncnc2n(nc(-c3cc4cc(O)ccc4[nH]3)c12)C1CCN(CC1)C(=O)C1CC1
Show InChI InChI=1S/C22H23N7O2/c23-20-18-19(17-10-13-9-15(30)3-4-16(13)26-17)27-29(21(18)25-11-24-20)14-5-7-28(8-6-14)22(31)12-1-2-12/h3-4,9-12,14,26,30H,1-2,5-8H2,(H2,23,24,25)
US Patent
n/an/a<25n/an/an/an/an/an/a
Intellikine LLC
US Patent
Assay Description
Class I PI3-Ks can be either purchased (p110α/p85α, p110β/p85α, p110δ/p85α from Upstate, and p110γ from Sigma) or...
US Patent US9828378 (2017)
BindingDB Entry DOI: 10.7270/Q2542QWN
Phosphatidylinositol 4,5-bisphosphate 3-kinase catalytic subunit alpha isoform
(Homo sapiens (Human))
BDBM315536
(US10172858, Table 2.31 | US9828378, # 31)
Show SMILES Nc1ncnc2n(nc(-c3cc4cc(O)ccc4[nH]3)c12)C1CCN(CC1)C(=O)C1CC1
Show InChI InChI=1S/C22H23N7O2/c23-20-18-19(17-10-13-9-15(30)3-4-16(13)26-17)27-29(21(18)25-11-24-20)14-5-7-28(8-6-14)22(31)12-1-2-12/h3-4,9-12,14,26,30H,1-2,5-8H2,(H2,23,24,25)
NCI pathway
Reactome pathway
US Patent
n/an/a>500n/an/an/an/an/an/a
Intellikine LLC
US Patent
Assay Description
Class I PI3-Ks can be either purchased (p110α/p85α, p110β/p85α, p110δ/p85α from Upstate, and p110γ from Sigma) or...
US Patent US9828378 (2017)
BindingDB Entry DOI: 10.7270/Q2542QWN
Phosphatidylinositol 4-phosphate 3-kinase C2 domain-containing subunit beta
(Homo sapiens (Human))
BDBM315536
(US10172858, Table 2.31 | US9828378, # 31)
Show SMILES Nc1ncnc2n(nc(-c3cc4cc(O)ccc4[nH]3)c12)C1CCN(CC1)C(=O)C1CC1
Show InChI InChI=1S/C22H23N7O2/c23-20-18-19(17-10-13-9-15(30)3-4-16(13)26-17)27-29(21(18)25-11-24-20)14-5-7-28(8-6-14)22(31)12-1-2-12/h3-4,9-12,14,26,30H,1-2,5-8H2,(H2,23,24,25)
NCI pathway
Reactome pathway
US Patent
n/an/a>500n/an/an/an/an/an/a
Intellikine LLC
US Patent
Assay Description
Class I PI3-Ks can be either purchased (p110α/p85α, p110β/p85α, p110δ/p85α from Upstate, and p110γ from Sigma) or...
US Patent US9828378 (2017)
BindingDB Entry DOI: 10.7270/Q2542QWN
Phosphatidylinositol 4,5-bisphosphate 3-kinase catalytic subunit delta isoform
(Homo sapiens (Human))
BDBM315536
(US10172858, Table 2.31 | US9828378, # 31)
Show SMILES Nc1ncnc2n(nc(-c3cc4cc(O)ccc4[nH]3)c12)C1CCN(CC1)C(=O)C1CC1
Show InChI InChI=1S/C22H23N7O2/c23-20-18-19(17-10-13-9-15(30)3-4-16(13)26-17)27-29(21(18)25-11-24-20)14-5-7-28(8-6-14)22(31)12-1-2-12/h3-4,9-12,14,26,30H,1-2,5-8H2,(H2,23,24,25)
NCI pathway
Reactome pathway
US Patent
n/an/a<500n/an/an/an/an/an/a
INTELLIKINE LLC
US Patent
Assay Description
This assay is relatively simple, reasonably sensitive, and the peptide substrate can be adjusted both in terms of sequence and concentration to meet ...
US Patent US10172858 (2019)
BindingDB Entry DOI: 10.7270/Q2736T01