BDBM31587 oxadiazole derivative, 20x
SMILES: COc1ccc(cc1)-n1cnc2ccc(cc12)-c1nnc(SCc2cccc(c2)C#N)o1
InChI Key: InChIKey=XUEHEOHRTKKVET-UHFFFAOYSA-N
Data: 6 IC50
Activity Spreadsheet -- Enzyme Inhibition Constant Data from BindingDB
Found 6 hits for monomerid = 31587
Trg + Lig
Ki
nM
ΔG°
kcal/mole
IC50
nM
Kd
nM
EC50/IC50
nM
koff
s-1
kon
M-1s-1
pHTemp
°C
Glycogen synthase kinase-3 beta
(Homo sapiens (Human))
BDBM31587
(oxadiazole derivative, 20x)
Show SMILES COc1ccc(cc1)-n1cnc2ccc(cc12)-c1nnc(SCc2cccc(c2)C#N)o1
Show InChI InChI=1S/C24H17N5O2S/c1-30-20-8-6-19(7-9-20)29-15-26-21-10-5-18(12-22(21)29)23-27-28-24(31-23)32-14-17-4-2-3-16(11-17)13-25/h2-12,15H,14H2,1H3
NCI pathway
Reactome pathway
n/an/a 2.30n/an/an/an/a7.537
Takeda Pharmaceutical Company Ltd.
Assay Description
Human GSK-3beta was expressed as the N-terminal FLAG-tagged protein using a baculovirus expression system. The kinase assay was was conducted in a 96...
Bioorg Med Chem 17: 2017-29 (2009)
Article DOI: 10.1016/j.bmc.2009.01.019
BindingDB Entry DOI: 10.7270/Q2DR2STZ
Cyclin-Dependent Kinase 2 (CDK2)
(Homo sapiens (Human))
BDBM31587
(oxadiazole derivative, 20x)
Show SMILES COc1ccc(cc1)-n1cnc2ccc(cc12)-c1nnc(SCc2cccc(c2)C#N)o1
Show InChI InChI=1S/C24H17N5O2S/c1-30-20-8-6-19(7-9-20)29-15-26-21-10-5-18(12-22(21)29)23-27-28-24(31-23)32-14-17-4-2-3-16(11-17)13-25/h2-12,15H,14H2,1H3
NCI pathway
Reactome pathway
n/an/a>1.00E+4n/an/an/an/an/an/a
Takeda Pharmaceutical Company Ltd.
Assay Description
Assays for serine/threonine kinases using radiolabeled [gamma-33P] ATP (GE Healthcare, Piscataway, NJ) were performed in 96 well plates. Prior to the...
Bioorg Med Chem 17: 2017-29 (2009)
Article DOI: 10.1016/j.bmc.2009.01.019
BindingDB Entry DOI: 10.7270/Q2DR2STZ
Protein kinase C theta type
(Homo sapiens (Human))
BDBM31587
(oxadiazole derivative, 20x)
Show SMILES COc1ccc(cc1)-n1cnc2ccc(cc12)-c1nnc(SCc2cccc(c2)C#N)o1
Show InChI InChI=1S/C24H17N5O2S/c1-30-20-8-6-19(7-9-20)29-15-26-21-10-5-18(12-22(21)29)23-27-28-24(31-23)32-14-17-4-2-3-16(11-17)13-25/h2-12,15H,14H2,1H3
NCI pathway
Reactome pathway
n/an/a 3.50E+3n/an/an/an/an/an/a
Takeda Pharmaceutical Company Ltd.
Assay Description
Assays for serine/threonine kinases using radiolabeled [gamma-33P] ATP (GE Healthcare, Piscataway, NJ) were performed in 96 well plates. Prior to the...
Bioorg Med Chem 17: 2017-29 (2009)
Article DOI: 10.1016/j.bmc.2009.01.019
BindingDB Entry DOI: 10.7270/Q2DR2STZ
Cyclin-Dependent Kinase 1 (CDK1)
(Homo sapiens (Human))
BDBM31587
(oxadiazole derivative, 20x)
Show SMILES COc1ccc(cc1)-n1cnc2ccc(cc12)-c1nnc(SCc2cccc(c2)C#N)o1
Show InChI InChI=1S/C24H17N5O2S/c1-30-20-8-6-19(7-9-20)29-15-26-21-10-5-18(12-22(21)29)23-27-28-24(31-23)32-14-17-4-2-3-16(11-17)13-25/h2-12,15H,14H2,1H3
Reactome pathway
n/an/a 4.60E+3n/an/an/an/an/an/a
Takeda Pharmaceutical Company Ltd.
Assay Description
Assays for serine/threonine kinases using radiolabeled [gamma-33P] ATP (GE Healthcare, Piscataway, NJ) were performed in 96 well plates. Prior to the...
Bioorg Med Chem 17: 2017-29 (2009)
Article DOI: 10.1016/j.bmc.2009.01.019
BindingDB Entry DOI: 10.7270/Q2DR2STZ
Mitogen-activated protein kinase kinase kinase 1
(Homo sapiens (Human))
BDBM31587
(oxadiazole derivative, 20x)
Show SMILES COc1ccc(cc1)-n1cnc2ccc(cc12)-c1nnc(SCc2cccc(c2)C#N)o1
Show InChI InChI=1S/C24H17N5O2S/c1-30-20-8-6-19(7-9-20)29-15-26-21-10-5-18(12-22(21)29)23-27-28-24(31-23)32-14-17-4-2-3-16(11-17)13-25/h2-12,15H,14H2,1H3
NCI pathway
Reactome pathway
n/an/a 8.10E+3n/an/an/an/an/an/a
Takeda Pharmaceutical Company Ltd.
Assay Description
Assays for serine/threonine kinases using radiolabeled [gamma-33P] ATP (GE Healthcare, Piscataway, NJ) were performed in 96 well plates. Prior to the...
Bioorg Med Chem 17: 2017-29 (2009)
Article DOI: 10.1016/j.bmc.2009.01.019
BindingDB Entry DOI: 10.7270/Q2DR2STZ
Cyclin-Dependent Kinase 5 (CDK5)
(Homo sapiens (Human))
BDBM31587
(oxadiazole derivative, 20x)
Show SMILES COc1ccc(cc1)-n1cnc2ccc(cc12)-c1nnc(SCc2cccc(c2)C#N)o1
Show InChI InChI=1S/C24H17N5O2S/c1-30-20-8-6-19(7-9-20)29-15-26-21-10-5-18(12-22(21)29)23-27-28-24(31-23)32-14-17-4-2-3-16(11-17)13-25/h2-12,15H,14H2,1H3
NCI pathway
Reactome pathway
n/an/a>1.00E+4n/an/an/an/an/a25
Takeda Pharmaceutical Company Ltd.
Assay Description
Human p35/ cyclin dependent kinase 5 (CDK5) was purchased from Millipore Corp. (Bedford, MA), which was expressed as N-terminal GST fusion protein us...
Bioorg Med Chem 17: 2017-29 (2009)
Article DOI: 10.1016/j.bmc.2009.01.019
BindingDB Entry DOI: 10.7270/Q2DR2STZ