BDBM31593 substituted pyrazole, 10
SMILES: Cn1ncc(c1-c1ccc(OCc2ccc3ccccc3n2)cc1)-c1ccncc1
InChI Key: InChIKey=PRWFSBVVFNTTJQ-UHFFFAOYSA-N
Data: 1 IC50
Activity Spreadsheet -- Enzyme Inhibition Constant Data from BindingDB
Found 1 hit for monomerid = 31593
Trg + Lig
Ki
nM
ΔG°
kcal/mole
IC50
nM
Kd
nM
EC50/IC50
nM
koff
s-1
kon
M-1s-1
pHTemp
°C
Phosphodiesterase Type 10 (PDE10A)
(Rattus norvegicus (rat))
BDBM31593
(substituted pyrazole, 10)
Show SMILES Cn1ncc(c1-c1ccc(OCc2ccc3ccccc3n2)cc1)-c1ccncc1
Show InChI InChI=1S/C25H20N4O/c1-29-25(23(16-27-29)18-12-14-26-15-13-18)20-7-10-22(11-8-20)30-17-21-9-6-19-4-2-3-5-24(19)28-21/h2-16H,17H2,1H3
Reactome pathway
n/an/a 1.54n/an/an/an/a7.523
Pfizer
Assay Description
PDE activity was measured using a plate-based Scintillation Proximity Assay (SPA). For competitive enzyme inhibition assays, the substrate [3H]cAMP c...
J Med Chem 52: 5188-96 (2009)
Article DOI: 10.1021/jm900521k
BindingDB Entry DOI: 10.7270/Q290223B