BDBM316293 2-Methoxy-4-[6-(2-methoxy-phenyl)-pyrimidin-4-ylamino]-phenol::US10294218, Example 121::US9617225, Example 121
SMILES: COc1cc(Nc2cc(ncn2)-c2ccccc2OC)ccc1O
InChI Key: InChIKey=OOAIRLPMRKYXJA-UHFFFAOYSA-N
Data: 2 IC50
Activity Spreadsheet -- Enzyme Inhibition Constant Data from BindingDB
Found 2 hits for monomerid = 316293
Trg + Lig
Ki
nM
ΔG°
kcal/mole
IC50
nM
Kd
nM
EC50/IC50
nM
koff
s-1
kon
M-1s-1
pHTemp
°C
Cyclin-Dependent Kinase 9 (CDK9)
(Homo sapiens (Human))
BDBM316293
(2-Methoxy-4-[6-(2-methoxy-phenyl)-pyrimidin-4-ylam...)
Show SMILES COc1cc(Nc2cc(ncn2)-c2ccccc2OC)ccc1O
Show InChI InChI=1S/C18H17N3O3/c1-23-16-6-4-3-5-13(16)14-10-18(20-11-19-14)21-12-7-8-15(22)17(9-12)24-2/h3-11,22H,1-2H3,(H,19,20,21)
Reactome pathway
US Patent
n/an/a<100n/an/an/an/an/an/a
GSK
Assay Description
The activity of the compounds described in the present invention can be determined by measuring the phosphorylation of a fluorescently-labeled peptid...
Bioorg Med Chem Lett 18: 1022-6 (2008)
BindingDB Entry DOI: 10.7270/Q2RB76X4
Cyclin-dependent kinase 9
(Homo sapiens (Human))
BDBM316293
(2-Methoxy-4-[6-(2-methoxy-phenyl)-pyrimidin-4-ylam...)
Show SMILES COc1cc(Nc2cc(ncn2)-c2ccccc2OC)ccc1O
Show InChI InChI=1S/C18H17N3O3/c1-23-16-6-4-3-5-13(16)14-10-18(20-11-19-14)21-12-7-8-15(22)17(9-12)24-2/h3-11,22H,1-2H3,(H,19,20,21)
Reactome pathway
US Patent
n/an/a<100n/an/an/an/an/an/a
VIROSTATICS SRL
US Patent
Assay Description
The activity of the compounds described in the present invention can be determined by measuring the phosphorylation of a fluorescently-labeled peptid...
US Patent US9617225 (2017)
BindingDB Entry DOI: 10.7270/Q29W0HK6