BDBM316369 US9617239, BRITE-354975
SMILES: O=S(=O)(NCCN1CCCC1)c1ccc(Oc2cccc(c2)N2CCNCC2)s1
InChI Key: InChIKey=QVJJMRPEYJWFNT-UHFFFAOYSA-N
Data: 1 IC50
Activity Spreadsheet -- Enzyme Inhibition Constant Data from BindingDB
Found 1 hit for monomerid = 316369
Trg + Lig
Ki
nM
ΔG°
kcal/mole
IC50
nM
Kd
nM
EC50/IC50
nM
koff
s-1
kon
M-1s-1
pHTemp
°C
Beta-glucuronidase
(Homo sapiens (Human))
BDBM316369
(US9617239, BRITE-354975)
Show SMILES O=S(=O)(NCCN1CCCC1)c1ccc(Oc2cccc(c2)N2CCNCC2)s1
Show InChI InChI=1S/C20H28N4O3S2/c25-29(26,22-10-13-23-11-1-2-12-23)20-7-6-19(28-20)27-18-5-3-4-17(16-18)24-14-8-21-9-15-24/h3-7,16,21-22H,1-2,8-15H2
US Patent
n/an/a 120n/an/an/an/an/an/a
North Carolina Central University; The University of North Carolina at Chapel Hill
US Patent
Assay Description
The β-glucuronidase assay was performed by the addition of 0.5 μl of compound (or DMSO) to the well of a black 384-well plate followed by t...
US Patent US9617239 (2017)
BindingDB Entry DOI: 10.7270/Q22B913V