BDBM316377 US9617239, BRITE-354979
SMILES: COc1ccc(NS(=O)(=O)c2ccc(Oc3cccc(c3)N3CCNCC3)s2)cc1
InChI Key: InChIKey=KNOCLGPSYCVWQH-UHFFFAOYSA-N
Data: 1 IC50
Activity Spreadsheet -- Enzyme Inhibition Constant Data from BindingDB
Found 1 hit for monomerid = 316377
Trg + Lig
Ki
nM
ΔG°
kcal/mole
IC50
nM
Kd
nM
EC50/IC50
nM
koff
s-1
kon
M-1s-1
pHTemp
°C
Beta-glucuronidase
(Homo sapiens (Human))
BDBM316377
(US9617239, BRITE-354979)
Show SMILES COc1ccc(NS(=O)(=O)c2ccc(Oc3cccc(c3)N3CCNCC3)s2)cc1
Show InChI InChI=1S/C21H23N3O4S2/c1-27-18-7-5-16(6-8-18)23-30(25,26)21-10-9-20(29-21)28-19-4-2-3-17(15-19)24-13-11-22-12-14-24/h2-10,15,22-23H,11-14H2,1H3
US Patent
n/an/a 230n/an/an/an/an/an/a
North Carolina Central University; The University of North Carolina at Chapel Hill
US Patent
Assay Description
The β-glucuronidase assay was performed by the addition of 0.5 μl of compound (or DMSO) to the well of a black 384-well plate followed by t...
US Patent US9617239 (2017)
BindingDB Entry DOI: 10.7270/Q22B913V