null
SMILES: CSCCCNS(=O)(=O)c1ccc(Oc2cccc(c2)N2CCNCC2)s1
InChI Key: InChIKey=JTHFTRUBEKCASO-UHFFFAOYSA-N
Activity Spreadsheet -- Enzyme Inhibition Constant Data from BindingDB
Found 1 hit for monomerid = 316394
Trg + Lig
Ki
nM
ΔG°
kcal/mole
IC50
nM
Kd
nM
EC50/IC50
nM
koff
s-1
kon
M-1s-1
pHTemp
°C
Beta-glucuronidase
(Homo sapiens (Human))
BDBM316394
(US9617239, BRITE-354948)
Show SMILES CSCCCNS(=O)(=O)c1ccc(Oc2cccc(c2)N2CCNCC2)s1
Show InChI InChI=1S/C18H25N3O3S3/c1-25-13-3-8-20-27(22,23)18-7-6-17(26-18)24-16-5-2-4-15(14-16)21-11-9-19-10-12-21/h2,4-7,14,19-20H,3,8-13H2,1H3
US Patent
n/an/a 390n/an/an/an/an/an/a
North Carolina Central University; The University of North Carolina at Chapel Hill
US Patent
Assay Description
The β-glucuronidase assay was performed by the addition of 0.5 μl of compound (or DMSO) to the well of a black 384-well plate followed by t...
US Patent US9617239 (2017)
BindingDB Entry DOI: 10.7270/Q22B913V