null
SMILES: CC(CCc1ccccc1)NS(=O)(=O)c1cc(Cl)c(Oc2cccc(c2)N2CCNCC2)s1
InChI Key: InChIKey=HRTVDOWENNTIHK-UHFFFAOYSA-N
Activity Spreadsheet -- Enzyme Inhibition Constant Data from BindingDB
Found 1 hit for monomerid = 316396
Trg + Lig
Ki
nM
ΔG°
kcal/mole
IC50
nM
Kd
nM
EC50/IC50
nM
koff
s-1
kon
M-1s-1
pHTemp
°C
Beta-glucuronidase
(Homo sapiens (Human))
BDBM316396
(US9617239, BRITE-355423)
Show SMILES CC(CCc1ccccc1)NS(=O)(=O)c1cc(Cl)c(Oc2cccc(c2)N2CCNCC2)s1
Show InChI InChI=1S/C24H28ClN3O3S2/c1-18(10-11-19-6-3-2-4-7-19)27-33(29,30)23-17-22(25)24(32-23)31-21-9-5-8-20(16-21)28-14-12-26-13-15-28/h2-9,16-18,26-27H,10-15H2,1H3
US Patent
n/an/a 430n/an/an/an/an/an/a
North Carolina Central University; The University of North Carolina at Chapel Hill
US Patent
Assay Description
The β-glucuronidase assay was performed by the addition of 0.5 μl of compound (or DMSO) to the well of a black 384-well plate followed by t...
US Patent US9617239 (2017)
BindingDB Entry DOI: 10.7270/Q22B913V