BDBM316475 2-{[(3R,6R)-6-methyl-1-{[2-(2H- 1,2,3-triazol-2- yl)phenyl]carbonyl}piperidin-3- yl]sulfanyl}pyridine-4-carbonitrile::US9617246, 9
SMILES: C[C@@H]1CC[C@H](CN1C(=O)c1ccccc1-n1nccn1)Sc1cc(ccn1)C#N
InChI Key: InChIKey=RUBZNQFRBGEBLL-NVXWUHKLSA-N
Data: 2 KI  4 IC50
Activity Spreadsheet -- Enzyme Inhibition Constant Data from BindingDB
Found 6 hits for monomerid = 316475
Trg + Lig
Ki
nM
ΔG°
kcal/mole
IC50
nM
Kd
nM
EC50/IC50
nM
koff
s-1
kon
M-1s-1
pHTemp
°C
Orexin receptor type 2
(Homo sapiens (Human))
BDBM316475
(2-{[(3R,6R)-6-methyl-1-{[2-(2H- 1,2,3-triazol-2- y...)
Show SMILES C[C@@H]1CC[C@H](CN1C(=O)c1ccccc1-n1nccn1)Sc1cc(ccn1)C#N
Show InChI InChI=1S/C21H20N6OS/c1-15-6-7-17(29-20-12-16(13-22)8-9-23-20)14-26(15)21(28)18-4-2-3-5-19(18)27-24-10-11-25-27/h2-5,8-12,15,17H,6-7,14H2,1H3/t15-,17-/m1/s1
Reactome pathway
1.70n/an/an/an/an/an/an/an/a
Merck& Co.
Curated by ChEMBL
Assay Description
Displacement of [3H](S)-N-(2-(1H-pyrrol-1-yl)phenyl)-1-(2-(1-methyl-1H-benzo[d]imidazol-2-ylthio)acetyl)pyrrolidine-2-carboxamide from human OX2R exp...
Bioorg Med Chem Lett 27: 1364-1370 (2017)
BindingDB Entry DOI: 10.7270/Q2WH2S8Q
Orexin/Hypocretin receptor type 1
(Homo sapiens (Human))
BDBM316475
(2-{[(3R,6R)-6-methyl-1-{[2-(2H- 1,2,3-triazol-2- y...)
Show SMILES C[C@@H]1CC[C@H](CN1C(=O)c1ccccc1-n1nccn1)Sc1cc(ccn1)C#N
Show InChI InChI=1S/C21H20N6OS/c1-15-6-7-17(29-20-12-16(13-22)8-9-23-20)14-26(15)21(28)18-4-2-3-5-19(18)27-24-10-11-25-27/h2-5,8-12,15,17H,6-7,14H2,1H3/t15-,17-/m1/s1
Reactome pathway
324n/an/an/an/an/an/an/an/a
Merck& Co.
Curated by ChEMBL
Assay Description
Displacement of [3H](S)-N-(biphenyl-2-yl)-1-(2-(1-methyl-1H-benzo[d]imidazol-2-ylthio)acetyl)pyrrolidine-2-carboxamide from human OX1R expressed in C...
Bioorg Med Chem Lett 27: 1364-1370 (2017)
BindingDB Entry DOI: 10.7270/Q2WH2S8Q
Orexin/Hypocretin receptor type 1
(Homo sapiens (Human))
BDBM316475
(2-{[(3R,6R)-6-methyl-1-{[2-(2H- 1,2,3-triazol-2- y...)
Show SMILES C[C@@H]1CC[C@H](CN1C(=O)c1ccccc1-n1nccn1)Sc1cc(ccn1)C#N
Show InChI InChI=1S/C21H20N6OS/c1-15-6-7-17(29-20-12-16(13-22)8-9-23-20)14-26(15)21(28)18-4-2-3-5-19(18)27-24-10-11-25-27/h2-5,8-12,15,17H,6-7,14H2,1H3/t15-,17-/m1/s1
Reactome pathway
US Patent
n/an/a 1.41E+3n/an/an/an/an/an/a
MERCK SHARP & DOHME CORP.
US Patent
US Patent US9617246 (2017)
BindingDB Entry DOI: 10.7270/Q2ST7RXW
Orexin receptor type 2
(Homo sapiens (Human))
BDBM316475
(2-{[(3R,6R)-6-methyl-1-{[2-(2H- 1,2,3-triazol-2- y...)
Show SMILES C[C@@H]1CC[C@H](CN1C(=O)c1ccccc1-n1nccn1)Sc1cc(ccn1)C#N
Show InChI InChI=1S/C21H20N6OS/c1-15-6-7-17(29-20-12-16(13-22)8-9-23-20)14-26(15)21(28)18-4-2-3-5-19(18)27-24-10-11-25-27/h2-5,8-12,15,17H,6-7,14H2,1H3/t15-,17-/m1/s1
Reactome pathway
US Patent
n/an/a 13.5n/an/an/an/an/an/a
MERCK SHARP & DOHME CORP.
US Patent
Assay Description
In a typical experiment the OX1 and OX2 receptor antagonistic activity of the compounds of the present invention was determined in accordance with th...
US Patent US9617246 (2017)
BindingDB Entry DOI: 10.7270/Q2ST7RXW
Orexin receptor type 2
(Homo sapiens (Human))
BDBM316475
(2-{[(3R,6R)-6-methyl-1-{[2-(2H- 1,2,3-triazol-2- y...)
Show SMILES C[C@@H]1CC[C@H](CN1C(=O)c1ccccc1-n1nccn1)Sc1cc(ccn1)C#N
Show InChI InChI=1S/C21H20N6OS/c1-15-6-7-17(29-20-12-16(13-22)8-9-23-20)14-26(15)21(28)18-4-2-3-5-19(18)27-24-10-11-25-27/h2-5,8-12,15,17H,6-7,14H2,1H3/t15-,17-/m1/s1
Reactome pathway
n/an/a 13n/an/an/an/an/an/a
Merck& Co.
Curated by ChEMBL
Assay Description
Antagonist activity at human OX2R expressed in CHOK1 cells assessed as reduction in orexin A-induced calcium flux preincubated followed by orexin A a...
Bioorg Med Chem Lett 27: 1364-1370 (2017)
BindingDB Entry DOI: 10.7270/Q2WH2S8Q
Orexin/Hypocretin receptor type 1
(Homo sapiens (Human))
BDBM316475
(2-{[(3R,6R)-6-methyl-1-{[2-(2H- 1,2,3-triazol-2- y...)
Show SMILES C[C@@H]1CC[C@H](CN1C(=O)c1ccccc1-n1nccn1)Sc1cc(ccn1)C#N
Show InChI InChI=1S/C21H20N6OS/c1-15-6-7-17(29-20-12-16(13-22)8-9-23-20)14-26(15)21(28)18-4-2-3-5-19(18)27-24-10-11-25-27/h2-5,8-12,15,17H,6-7,14H2,1H3/t15-,17-/m1/s1
Reactome pathway
n/an/a 1.41E+3n/an/an/an/an/an/a
Merck& Co.
Curated by ChEMBL
Assay Description
Antagonist activity at human OX1R expressed in CHOK1 cells assessed as reduction in orexin A-induced calcium flux preincubated followed by orexin A a...
Bioorg Med Chem Lett 27: 1364-1370 (2017)
BindingDB Entry DOI: 10.7270/Q2WH2S8Q