BDBM31659 imidazole-dioxolane, 11
SMILES: COc1ccc(SC[C@@H]2CO[C@@](CCc3ccc(Cl)cc3)(Cn3ccnc3)O2)cc1
InChI Key: InChIKey=MUSDNMUEOVYGKB-JTHBVZDNSA-N
Data: 2 IC50
Activity Spreadsheet -- Enzyme Inhibition Constant Data from BindingDB
Found 2 hits for monomerid = 31659
Trg + Lig
Ki
nM
ΔG°
kcal/mole
IC50
nM
Kd
nM
EC50/IC50
nM
koff
s-1
kon
M-1s-1
pHTemp
°C
Heme Oxygenase 2 (HO-2)
(Rattus norvegicus (rat))
BDBM31659
(imidazole-dioxolane, 11)
Show SMILES COc1ccc(SC[C@@H]2CO[C@@](CCc3ccc(Cl)cc3)(Cn3ccnc3)O2)cc1 |r|
Show InChI InChI=1S/C23H25ClN2O3S/c1-27-20-6-8-22(9-7-20)30-15-21-14-28-23(29-21,16-26-13-12-25-17-26)11-10-18-2-4-19(24)5-3-18/h2-9,12-13,17,21H,10-11,14-16H2,1H3/t21-,23+/m0/s1
Reactome pathway
n/an/a 2.50E+3n/an/an/an/a7.4n/a
Queen's University
Assay Description
HO activity in rat spleen (HO-1) and brain (HO-2) microsomal fractions was determined by the quantitation of CO formed from the degradation of methem...
Bioorg Med Chem 17: 2461-75 (2009)
Article DOI: 10.1016/j.bmc.2009.01.078
BindingDB Entry DOI: 10.7270/Q2WQ0250
Heme Oxygenase 1 (HO-1)
(Rattus norvegicus (rat))
BDBM31659
(imidazole-dioxolane, 11)
Show SMILES COc1ccc(SC[C@@H]2CO[C@@](CCc3ccc(Cl)cc3)(Cn3ccnc3)O2)cc1 |r|
Show InChI InChI=1S/C23H25ClN2O3S/c1-27-20-6-8-22(9-7-20)30-15-21-14-28-23(29-21,16-26-13-12-25-17-26)11-10-18-2-4-19(24)5-3-18/h2-9,12-13,17,21H,10-11,14-16H2,1H3/t21-,23+/m0/s1
Reactome pathway
n/an/a 700n/an/an/an/a7.437
Queen's University
Assay Description
HO activity in rat spleen (HO-1) and brain (HO-2) microsomal fractions was determined by the quantitation of CO formed from the degradation of methem...
Bioorg Med Chem 17: 2461-75 (2009)
Article DOI: 10.1016/j.bmc.2009.01.078
BindingDB Entry DOI: 10.7270/Q2WQ0250