BDBM31660 imidazole-dioxolane, 12
SMILES: Clc1ccc(CC[C@@]2(Cn3ccnc3)OC[C@@H](CSc3ccc(Cl)cc3)O2)cc1
InChI Key: InChIKey=ZNMLLEJYHQBEFI-RBBKRZOGSA-N
Data: 2 IC50
Activity Spreadsheet -- Enzyme Inhibition Constant Data from BindingDB
Found 2 hits for monomerid = 31660
Trg + Lig
Ki
nM
ΔG°
kcal/mole
IC50
nM
Kd
nM
EC50/IC50
nM
koff
s-1
kon
M-1s-1
pHTemp
°C
Heme Oxygenase 2 (HO-2)
(Rattus norvegicus (rat))
BDBM31660
(imidazole-dioxolane, 12)
Show SMILES Clc1ccc(CC[C@@]2(Cn3ccnc3)OC[C@@H](CSc3ccc(Cl)cc3)O2)cc1 |r|
Show InChI InChI=1S/C22H22Cl2N2O2S/c23-18-3-1-17(2-4-18)9-10-22(15-26-12-11-25-16-26)27-13-20(28-22)14-29-21-7-5-19(24)6-8-21/h1-8,11-12,16,20H,9-10,13-15H2/t20-,22+/m0/s1
Reactome pathway
n/an/a 1.20E+4n/an/an/an/a7.4n/a
Queen's University
Assay Description
HO activity in rat spleen (HO-1) and brain (HO-2) microsomal fractions was determined by the quantitation of CO formed from the degradation of methem...
Bioorg Med Chem 17: 2461-75 (2009)
Article DOI: 10.1016/j.bmc.2009.01.078
BindingDB Entry DOI: 10.7270/Q2WQ0250
Heme Oxygenase 1 (HO-1)
(Rattus norvegicus (rat))
BDBM31660
(imidazole-dioxolane, 12)
Show SMILES Clc1ccc(CC[C@@]2(Cn3ccnc3)OC[C@@H](CSc3ccc(Cl)cc3)O2)cc1 |r|
Show InChI InChI=1S/C22H22Cl2N2O2S/c23-18-3-1-17(2-4-18)9-10-22(15-26-12-11-25-16-26)27-13-20(28-22)14-29-21-7-5-19(24)6-8-21/h1-8,11-12,16,20H,9-10,13-15H2/t20-,22+/m0/s1
Reactome pathway
n/an/a 2.80E+3n/an/an/an/a7.437
Queen's University
Assay Description
HO activity in rat spleen (HO-1) and brain (HO-2) microsomal fractions was determined by the quantitation of CO formed from the degradation of methem...
Bioorg Med Chem 17: 2461-75 (2009)
Article DOI: 10.1016/j.bmc.2009.01.078
BindingDB Entry DOI: 10.7270/Q2WQ0250