BDBM316693 2-[(1-acryloylazetidin-3-yl)amino]-N-(propan-2-yl)-5H-pyrrolo[2,3-b]pyrazine-7-carboxamide::US9617258, Example 188
SMILES: CC(C)NC(=O)c1c[nH]c2ncc(NC3CN(C3)C(=O)C=C)nc12
InChI Key: InChIKey=JQSIDKLDARXUHP-UHFFFAOYSA-N
Data: 2 IC50
Activity Spreadsheet -- Enzyme Inhibition Constant Data from BindingDB
Found 4 hits for monomerid = 316693
Trg + Lig
Ki
nM
ΔG°
kcal/mole
IC50
nM
Kd
nM
EC50/IC50
nM
koff
s-1
kon
M-1s-1
pHTemp
°C
Tyrosine-protein kinase JAK3
(Homo sapiens (Human))
BDBM316693
(2-[(1-acryloylazetidin-3-yl)amino]-N-(propan-2-yl)...)
Show SMILES CC(C)NC(=O)c1c[nH]c2ncc(NC3CN(C3)C(=O)C=C)nc12
Show InChI InChI=1S/C16H20N6O2/c1-4-13(23)22-7-10(8-22)20-12-6-18-15-14(21-12)11(5-17-15)16(24)19-9(2)3/h4-6,9-10H,1,7-8H2,2-3H3,(H,17,18)(H,19,24)(H,20,21)
Reactome pathway
US Patent
n/an/a 0.300n/an/an/an/an/an/a
Pfizer Inc.
US Patent
Assay Description
Test article was solubilized in dimethyl sulfoxide (DMSO) to a stock concentration of 30 mM. An 11-point half log dilution series was created in DMSO...
US Patent US9617258 (2017)
BindingDB Entry DOI: 10.7270/Q2JD4ZWG
Tyrosine-protein kinase JAK3
(Homo sapiens (Human))
BDBM316693
(2-[(1-acryloylazetidin-3-yl)amino]-N-(propan-2-yl)...)
Show SMILES CC(C)NC(=O)c1c[nH]c2ncc(NC3CN(C3)C(=O)C=C)nc12
Show InChI InChI=1S/C16H20N6O2/c1-4-13(23)22-7-10(8-22)20-12-6-18-15-14(21-12)11(5-17-15)16(24)19-9(2)3/h4-6,9-10H,1,7-8H2,2-3H3,(H,17,18)(H,19,24)(H,20,21)
Reactome pathway
n/an/a 8.80n/an/an/an/an/an/a
TBA
Citation and Details
Tyrosine-protein kinase JAK3
(Homo sapiens (Human))
BDBM316693
(2-[(1-acryloylazetidin-3-yl)amino]-N-(propan-2-yl)...)
Show SMILES CC(C)NC(=O)c1c[nH]c2ncc(NC3CN(C3)C(=O)C=C)nc12
Show InChI InChI=1S/C16H20N6O2/c1-4-13(23)22-7-10(8-22)20-12-6-18-15-14(21-12)11(5-17-15)16(24)19-9(2)3/h4-6,9-10H,1,7-8H2,2-3H3,(H,17,18)(H,19,24)(H,20,21)
Reactome pathway
n/an/a 0.300n/an/an/an/an/an/a
TBA
Citation and Details
Tyrosine-protein kinase JAK3
(Homo sapiens (Human))
BDBM316693
(2-[(1-acryloylazetidin-3-yl)amino]-N-(propan-2-yl)...)
Show SMILES CC(C)NC(=O)c1c[nH]c2ncc(NC3CN(C3)C(=O)C=C)nc12
Show InChI InChI=1S/C16H20N6O2/c1-4-13(23)22-7-10(8-22)20-12-6-18-15-14(21-12)11(5-17-15)16(24)19-9(2)3/h4-6,9-10H,1,7-8H2,2-3H3,(H,17,18)(H,19,24)(H,20,21)
Reactome pathway
US Patent
n/an/a 8.80n/an/an/an/an/an/a
Pfizer Inc.
US Patent
Assay Description
Test article was solubilized in dimethyl sulfoxide (DMSO) to a stock concentration of 30 mM. An 11-point half log dilution series was created in DMSO...
US Patent US9617258 (2017)
BindingDB Entry DOI: 10.7270/Q2JD4ZWG