BDBM3167 3-[1-(2-aminoethyl)-1H-indol-3-yl]-4-(1-methyl-1H-indol-3-yl)-2,5-dihydro-1H-pyrrole-2,5-dione::Bisindolylmaleimide 6a
SMILES: Cn1cc(C2=C(C(=O)NC2=O)c2cn(CCN)c3ccccc23)c2ccccc12
InChI Key: InChIKey=OZVIXSLTRMYODX-UHFFFAOYSA-N
Data: 2 IC50
PDB links: 9 PDB IDs contain inhibitors having a similarity of 90% to this monomer.
Activity Spreadsheet -- Enzyme Inhibition Constant Data from BindingDB
Found 2 hits for monomerid = 3167
Trg + Lig
Ki
nM
ΔG°
kcal/mole
IC50
nM
Kd
nM
EC50/IC50
nM
koff
s-1
kon
M-1s-1
pHTemp
°C
cAMP-Dependent Protein Kinase (PKA)
(Bos taurus (bovine))
BDBM3167
(3-[1-(2-aminoethyl)-1H-indol-3-yl]-4-(1-methyl-1H-...)
Show SMILES Cn1cc(C2=C(C(=O)NC2=O)c2cn(CCN)c3ccccc23)c2ccccc12 |t:4|
Show InChI InChI=1S/C23H20N4O2/c1-26-12-16(14-6-2-4-8-18(14)26)20-21(23(29)25-22(20)28)17-13-27(11-10-24)19-9-5-3-7-15(17)19/h2-9,12-13H,10-11,24H2,1H3,(H,25,28,29)
n/an/a 8.90E+3n/an/an/an/a8.537
Roche Products Limited
Assay Description
The activity of PKA, activated by cAMP, is measured by its ability to transfer phosphate from [gamma-32P]ATP to histone.
J Med Chem 35: 994-1001 (1992)
Article DOI: 10.1021/jm00084a004
BindingDB Entry DOI: 10.7270/Q2M043KK
Protein Kinase C
(Rattus norvegicus (rat))
BDBM3167
(3-[1-(2-aminoethyl)-1H-indol-3-yl]-4-(1-methyl-1H-...)
Show SMILES Cn1cc(C2=C(C(=O)NC2=O)c2cn(CCN)c3ccccc23)c2ccccc12 |t:4|
Show InChI InChI=1S/C23H20N4O2/c1-26-12-16(14-6-2-4-8-18(14)26)20-21(23(29)25-22(20)28)17-13-27(11-10-24)19-9-5-3-7-15(17)19/h2-9,12-13H,10-11,24H2,1H3,(H,25,28,29)
n/an/a 64n/an/an/an/a7.530
Roche Products Limited
Assay Description
The activity of PKC, activated by phosphatidylerine and Ca2+, is measured by its ability to transfer phosphate from [gamma-32P]ATP to lysine-rich his...
J Med Chem 35: 994-1001 (1992)
Article DOI: 10.1021/jm00084a004
BindingDB Entry DOI: 10.7270/Q2M043KK