BDBM31677 imidazole-dioxolane, 29
SMILES: Clc1ccc(CC[C@@]2(Cn3ccnc3)OC[C@@H](COc3ccc(cc3)C#N)O2)cc1
InChI Key: InChIKey=RGJNTVPHUAKXGQ-DHIUTWEWSA-N
Data: 3 IC50
Activity Spreadsheet -- Enzyme Inhibition Constant Data from BindingDB
Found 3 hits for monomerid = 31677
Trg + Lig
Ki
nM
ΔG°
kcal/mole
IC50
nM
Kd
nM
EC50/IC50
nM
koff
s-1
kon
M-1s-1
pHTemp
°C
Heme Oxygenase 1 (HO-1)
(Rattus norvegicus (rat))
BDBM31677
(imidazole-dioxolane, 29)
Show SMILES Clc1ccc(CC[C@@]2(Cn3ccnc3)OC[C@@H](COc3ccc(cc3)C#N)O2)cc1 |r|
Show InChI InChI=1S/C23H22ClN3O3/c24-20-5-1-18(2-6-20)9-10-23(16-27-12-11-26-17-27)29-15-22(30-23)14-28-21-7-3-19(13-25)4-8-21/h1-8,11-12,17,22H,9-10,14-16H2/t22-,23-/m1/s1
Reactome pathway
n/an/a 670n/an/an/an/a7.437
Queen's University
Assay Description
HO activity in rat spleen (HO-1) and brain (HO-2) microsomal fractions was determined by the quantitation of CO formed from the degradation of methem...
Bioorg Med Chem 17: 2461-75 (2009)
Article DOI: 10.1016/j.bmc.2009.01.078
BindingDB Entry DOI: 10.7270/Q2WQ0250
Cytochrome P450 3A1
(Rattus norvegicus (rat))
BDBM31677
(imidazole-dioxolane, 29)
Show SMILES Clc1ccc(CC[C@@]2(Cn3ccnc3)OC[C@@H](COc3ccc(cc3)C#N)O2)cc1 |r|
Show InChI InChI=1S/C23H22ClN3O3/c24-20-5-1-18(2-6-20)9-10-23(16-27-12-11-26-17-27)29-15-22(30-23)14-28-21-7-3-19(13-25)4-8-21/h1-8,11-12,17,22H,9-10,14-16H2/t22-,23-/m1/s1
n/an/a 6.90E+3n/an/an/an/an/an/a
Queen's University
Assay Description
CYP3A1/3A2-catalyzed erythromycin N-demethylase activity was determined by the spectrophotometric measurement of formaldehyde. Briefly, reaction mixt...
Bioorg Med Chem 17: 2461-75 (2009)
Article DOI: 10.1016/j.bmc.2009.01.078
BindingDB Entry DOI: 10.7270/Q2WQ0250
Heme Oxygenase 2 (HO-2)
(Rattus norvegicus (rat))
BDBM31677
(imidazole-dioxolane, 29)
Show SMILES Clc1ccc(CC[C@@]2(Cn3ccnc3)OC[C@@H](COc3ccc(cc3)C#N)O2)cc1 |r|
Show InChI InChI=1S/C23H22ClN3O3/c24-20-5-1-18(2-6-20)9-10-23(16-27-12-11-26-17-27)29-15-22(30-23)14-28-21-7-3-19(13-25)4-8-21/h1-8,11-12,17,22H,9-10,14-16H2/t22-,23-/m1/s1
Reactome pathway
n/an/a 1.70E+3n/an/an/an/a7.4n/a
Queen's University
Assay Description
HO activity in rat spleen (HO-1) and brain (HO-2) microsomal fractions was determined by the quantitation of CO formed from the degradation of methem...
Bioorg Med Chem 17: 2461-75 (2009)
Article DOI: 10.1016/j.bmc.2009.01.078
BindingDB Entry DOI: 10.7270/Q2WQ0250