null
SMILES: CC[C@H](C)NC(=O)c1c[nH]c2ncc(NC3CCN(CC3)C(=O)C=C)nc12
InChI Key:
Activity Spreadsheet -- Enzyme Inhibition Constant Data from BindingDB
Found 4 hits for monomerid = 316789
Trg + Lig
Ki
nM
ΔG°
kcal/mole
IC50
nM
Kd
nM
EC50/IC50
nM
koff
s-1
kon
M-1s-1
pHTemp
°C
Tyrosine-protein kinase JAK3
(Homo sapiens (Human))
BDBM316789
(2-[(1-acryloylpiperidin-4-yl)amino]-N-[(2S)-butan-...)
Show SMILES CC[C@H](C)NC(=O)c1c[nH]c2ncc(NC3CCN(CC3)C(=O)C=C)nc12 |r|
Reactome pathway
US Patent
n/an/a 0.300n/an/an/an/an/an/a
Pfizer Inc.
US Patent
Assay Description
Test article was solubilized in dimethyl sulfoxide (DMSO) to a stock concentration of 30 mM. An 11-point half log dilution series was created in DMSO...
US Patent US9617258 (2017)
BindingDB Entry DOI: 10.7270/Q2JD4ZWG
Tyrosine-protein kinase JAK3
(Homo sapiens (Human))
BDBM316789
(2-[(1-acryloylpiperidin-4-yl)amino]-N-[(2S)-butan-...)
Show SMILES CC[C@H](C)NC(=O)c1c[nH]c2ncc(NC3CCN(CC3)C(=O)C=C)nc12 |r|
Reactome pathway
US Patent
n/an/a 8.5n/an/an/an/an/an/a
TBA
Assay Description
JAK Caliper Enzyme Assay at 1 mM ATP: Test article was solubilized in dimethyl sulfoxide (DMSO) to a stock concentration of 30 mM. An 11-point half l...
Citation and Details
BindingDB Entry DOI: 10.7270/Q29026XR
Tyrosine-protein kinase JAK3
(Homo sapiens (Human))
BDBM316789
(2-[(1-acryloylpiperidin-4-yl)amino]-N-[(2S)-butan-...)
Show SMILES CC[C@H](C)NC(=O)c1c[nH]c2ncc(NC3CCN(CC3)C(=O)C=C)nc12 |r|
Reactome pathway
US Patent
n/an/a 0.300n/an/an/an/an/an/a
TBA
Assay Description
JAK Caliper Enzyme Assay at 4 μM: Test article was solubilized in dimethyl sulfoxide (DMSO) to a stock concentration of 30 mM. An 11-point half ...
Citation and Details
BindingDB Entry DOI: 10.7270/Q29026XR
Tyrosine-protein kinase JAK3
(Homo sapiens (Human))
BDBM316789
(2-[(1-acryloylpiperidin-4-yl)amino]-N-[(2S)-butan-...)
Show SMILES CC[C@H](C)NC(=O)c1c[nH]c2ncc(NC3CCN(CC3)C(=O)C=C)nc12 |r|
Reactome pathway
US Patent
n/an/a 8.5n/an/an/an/an/an/a
Pfizer Inc.
US Patent
Assay Description
Test article was solubilized in dimethyl sulfoxide (DMSO) to a stock concentration of 30 mM. An 11-point half log dilution series was created in DMSO...
US Patent US9617258 (2017)
BindingDB Entry DOI: 10.7270/Q2JD4ZWG