BDBM31684 imidazole-dioxolane, 34
SMILES: ClC[C@@H]1CO[C@@](CCc2ccc(Cl)cc2)(Cn2ccnc2)O1
InChI Key: InChIKey=MJHHVTRHTQVHQJ-HZPDHXFCSA-N
Data: 2 IC50
Activity Spreadsheet -- Enzyme Inhibition Constant Data from BindingDB
Found 2 hits for monomerid = 31684
Trg + Lig
Ki
nM
ΔG°
kcal/mole
IC50
nM
Kd
nM
EC50/IC50
nM
koff
s-1
kon
M-1s-1
pHTemp
°C
Heme Oxygenase 2 (HO-2)
(Rattus norvegicus (rat))
BDBM31684
(imidazole-dioxolane, 34)
Show SMILES ClC[C@@H]1CO[C@@](CCc2ccc(Cl)cc2)(Cn2ccnc2)O1 |r|
Show InChI InChI=1S/C16H18Cl2N2O2/c17-9-15-10-21-16(22-15,11-20-8-7-19-12-20)6-5-13-1-3-14(18)4-2-13/h1-4,7-8,12,15H,5-6,9-11H2/t15-,16-/m1/s1
Reactome pathway
n/an/a 1.22E+5n/an/an/an/a7.4n/a
Queen's University
Assay Description
HO activity in rat spleen (HO-1) and brain (HO-2) microsomal fractions was determined by the quantitation of CO formed from the degradation of methem...
Bioorg Med Chem 17: 2461-75 (2009)
Article DOI: 10.1016/j.bmc.2009.01.078
BindingDB Entry DOI: 10.7270/Q2WQ0250
Heme Oxygenase 1 (HO-1)
(Rattus norvegicus (rat))
BDBM31684
(imidazole-dioxolane, 34)
Show SMILES ClC[C@@H]1CO[C@@](CCc2ccc(Cl)cc2)(Cn2ccnc2)O1 |r|
Show InChI InChI=1S/C16H18Cl2N2O2/c17-9-15-10-21-16(22-15,11-20-8-7-19-12-20)6-5-13-1-3-14(18)4-2-13/h1-4,7-8,12,15H,5-6,9-11H2/t15-,16-/m1/s1
Reactome pathway
n/an/a 3.50E+3n/an/an/an/a7.4n/a
Queen's University
Assay Description
HO activity in rat spleen (HO-1) and brain (HO-2) microsomal fractions was determined by the quantitation of CO formed from the degradation of methem...
Bioorg Med Chem 17: 2461-75 (2009)
Article DOI: 10.1016/j.bmc.2009.01.078
BindingDB Entry DOI: 10.7270/Q2WQ0250
3D
3D Structure (docked)