null
SMILES: CCOC(=O)N1CCN(CC(=O)Nc2cc(OCC)ccc2OCC)CC1
InChI Key: InChIKey=ADAARZDRHRJLIY-UHFFFAOYSA-N
Activity Spreadsheet -- Enzyme Inhibition Constant Data from BindingDB
Found 6 hits for monomerid = 31693
Trg + Lig
Ki
nM
ΔG°
kcal/mole
IC50
nM
Kd
nM
EC50/IC50
nM
koff
s-1
kon
M-1s-1
pHTemp
°C
Heat shock 70 kDa protein 1A
(Homo sapiens (Human))
BDBM31693
(4-[(2,5-Diethoxy-phenylcarbamoyl)-methyl]-piperazi...)
Show SMILES CCOC(=O)N1CCN(CC(=O)Nc2cc(OCC)ccc2OCC)CC1
Show InChI InChI=1S/C19H29N3O5/c1-4-25-15-7-8-17(26-5-2)16(13-15)20-18(23)14-21-9-11-22(12-10-21)19(24)27-6-3/h7-8,13H,4-6,9-12,14H2,1-3H3,(H,20,23)
PCBioAssay
n/an/a 1.00E+5n/an/an/an/a7.023
Burnham Center for Chemical Genomics
Curated by PubChem BioAssay
Assay Description
Burnham Center for Chemical Genomics (BCCG) Burnham Institute for Medical Research (San Diego, CA) NIH Molecular Libraries Screening Centers Network ...
PubChem Bioassay (2008)
BindingDB Entry DOI: 10.7270/Q2S180TW
Mevalonate kinase
(Streptococcus pneumoniae D39)
BDBM31693
(4-[(2,5-Diethoxy-phenylcarbamoyl)-methyl]-piperazi...)
Show SMILES CCOC(=O)N1CCN(CC(=O)Nc2cc(OCC)ccc2OCC)CC1
Show InChI InChI=1S/C19H29N3O5/c1-4-25-15-7-8-17(26-5-2)16(13-15)20-18(23)14-21-9-11-22(12-10-21)19(24)27-6-3/h7-8,13H,4-6,9-12,14H2,1-3H3,(H,20,23)
PCBioAssay
n/an/a>1.00E+7n/an/an/an/an/an/a
SRMLSC
Curated by PubChem BioAssay
Assay Description
Southern Research Molecular Libraries Screening Center (SRMLSC) Southern Research Institute (Birmingham, Alabama) NIH Molecular Libraries Screening C...
PubChem Bioassay (2007)
BindingDB Entry DOI: 10.7270/Q27P8WSS
Heat shock cognate 71 kDa protein
(Homo sapiens (Human))
BDBM31693
(4-[(2,5-Diethoxy-phenylcarbamoyl)-methyl]-piperazi...)
Show SMILES CCOC(=O)N1CCN(CC(=O)Nc2cc(OCC)ccc2OCC)CC1
Show InChI InChI=1S/C19H29N3O5/c1-4-25-15-7-8-17(26-5-2)16(13-15)20-18(23)14-21-9-11-22(12-10-21)19(24)27-6-3/h7-8,13H,4-6,9-12,14H2,1-3H3,(H,20,23)
Reactome pathway
PCBioAssay
n/an/a 9.99E+5n/an/an/an/an/an/a
Burnham Center for Chemical Genomics
Curated by PubChem BioAssay
Assay Description
Sanford-Burnham Center for Chemical Genomics (SBCCG) Sanford-Burnham Medical Research Institute (San Diego, CA) NIH Molecular Libraries Screening Cen...
PubChem Bioassay (2007)
BindingDB Entry DOI: 10.7270/Q2MS3R62
Mevalonate kinase
(Streptococcus pneumoniae D39)
BDBM31693
(4-[(2,5-Diethoxy-phenylcarbamoyl)-methyl]-piperazi...)
Show SMILES CCOC(=O)N1CCN(CC(=O)Nc2cc(OCC)ccc2OCC)CC1
Show InChI InChI=1S/C19H29N3O5/c1-4-25-15-7-8-17(26-5-2)16(13-15)20-18(23)14-21-9-11-22(12-10-21)19(24)27-6-3/h7-8,13H,4-6,9-12,14H2,1-3H3,(H,20,23)
PCBioAssay
n/an/a>1.00E+7n/an/an/an/an/an/a
SRMLSC
Curated by PubChem BioAssay
Assay Description
Southern Research Molecular Libraries Screening Center (SRMLSC) Southern Research Institute (Birmingham, Alabama) NIH Molecular Libraries Screening C...
PubChem Bioassay (2007)
BindingDB Entry DOI: 10.7270/Q2CF9NG2
Heat shock 70 kDa protein 1A
(Homo sapiens (Human))
BDBM31693
(4-[(2,5-Diethoxy-phenylcarbamoyl)-methyl]-piperazi...)
Show SMILES CCOC(=O)N1CCN(CC(=O)Nc2cc(OCC)ccc2OCC)CC1
Show InChI InChI=1S/C19H29N3O5/c1-4-25-15-7-8-17(26-5-2)16(13-15)20-18(23)14-21-9-11-22(12-10-21)19(24)27-6-3/h7-8,13H,4-6,9-12,14H2,1-3H3,(H,20,23)
PCBioAssay
n/an/a>1.00E+5n/an/an/an/an/an/a
Burnham Center for Chemical Genomics
Curated by PubChem BioAssay
Assay Description
Sanford-Burnham Center for Chemical Genomics (SBCCG) Sanford-Burnham Medical Research Institute (San Diego, CA) NIH Molecular Libraries Screening Cen...
PubChem Bioassay (2008)
BindingDB Entry DOI: 10.7270/Q2RF5SF5
Mevalonate kinase
(Streptococcus pneumoniae D39)
BDBM31693
(4-[(2,5-Diethoxy-phenylcarbamoyl)-methyl]-piperazi...)
Show SMILES CCOC(=O)N1CCN(CC(=O)Nc2cc(OCC)ccc2OCC)CC1
Show InChI InChI=1S/C19H29N3O5/c1-4-25-15-7-8-17(26-5-2)16(13-15)20-18(23)14-21-9-11-22(12-10-21)19(24)27-6-3/h7-8,13H,4-6,9-12,14H2,1-3H3,(H,20,23)
PCBioAssay
n/an/a 1.63E+5n/an/an/an/an/an/a
SRMLSC
Curated by PubChem BioAssay
Assay Description
Southern Research Molecular Libraries Screening Center (SRMLSC) Southern Research Institute (Birmingham, Alabama) NIH Molecular Libraries Screening C...
PubChem Bioassay (2007)
BindingDB Entry DOI: 10.7270/Q23X852V