BDBM317216 US9617272, Compound 27::US9981973, Compound 27
SMILES: O=C(CC1c2cncn2-c2ccccc12)C1CCCCC1
InChI Key: InChIKey=JYJDZMRPACDCEJ-UHFFFAOYSA-N
Data: 4 IC50
Activity Spreadsheet -- Enzyme Inhibition Constant Data from BindingDB
Found 4 hits for monomerid = 317216
Trg + Lig
Ki
nM
ΔG°
kcal/mole
IC50
nM
Kd
nM
EC50/IC50
nM
koff
s-1
kon
M-1s-1
pHTemp
°C
Indoleamine 2,3-dioxygenase 1
(Homo sapiens (Human))
BDBM317216
(US9617272, Compound 27 | US9981973, Compound 27)
Show SMILES O=C(CC1c2cncn2-c2ccccc12)C1CCCCC1
Show InChI InChI=1S/C18H20N2O/c21-18(13-6-2-1-3-7-13)10-15-14-8-4-5-9-16(14)20-12-19-11-17(15)20/h4-5,8-9,11-13,15H,1-3,6-7,10H2
Reactome pathway
US Patent
n/an/a 550n/an/an/an/an/an/a
NewLink Genetics Corporation
US Patent
Assay Description
The IC50 values for each compound were determined by testing the activity of IDO in a mixture containing 50 mM potassium phosphate buffer at pH 6.5; ...
US Patent US9617272 (2017)
BindingDB Entry DOI: 10.7270/Q2HD7XQN
Tryptophan 2,3-dioxygenase
(Homo sapiens (Human))
BDBM317216
(US9617272, Compound 27 | US9981973, Compound 27)
Show SMILES O=C(CC1c2cncn2-c2ccccc12)C1CCCCC1
Show InChI InChI=1S/C18H20N2O/c21-18(13-6-2-1-3-7-13)10-15-14-8-4-5-9-16(14)20-12-19-11-17(15)20/h4-5,8-9,11-13,15H,1-3,6-7,10H2
Reactome pathway
US Patent
n/an/a<1.00E+3n/an/an/an/an/an/a
Pfizer
Assay Description
The IC50 values for each compound were determined by testing the activity of TDO in a mixture containing 50 mM potassium phosphate buffer at pH 6.5; ...
J Med Chem 52: 3576-85 (2009)
BindingDB Entry DOI: 10.7270/Q2K35X00
Indoleamine 2,3-dioxygenase 1
(Homo sapiens (Human))
BDBM317216
(US9617272, Compound 27 | US9981973, Compound 27)
Show SMILES O=C(CC1c2cncn2-c2ccccc12)C1CCCCC1
Show InChI InChI=1S/C18H20N2O/c21-18(13-6-2-1-3-7-13)10-15-14-8-4-5-9-16(14)20-12-19-11-17(15)20/h4-5,8-9,11-13,15H,1-3,6-7,10H2
Reactome pathway
US Patent
n/an/a 1.00E+3n/an/an/an/an/an/a
Pfizer
Assay Description
The IC50 values for each compound were determined by testing the activity of IDO in a mixture containing 50 mM potassium phosphate buffer at pH 6.5; ...
J Med Chem 52: 3576-85 (2009)
BindingDB Entry DOI: 10.7270/Q2K35X00
Tryptophan 2,3-dioxygenase
(Homo sapiens (Human))
BDBM317216
(US9617272, Compound 27 | US9981973, Compound 27)
Show SMILES O=C(CC1c2cncn2-c2ccccc12)C1CCCCC1
Show InChI InChI=1S/C18H20N2O/c21-18(13-6-2-1-3-7-13)10-15-14-8-4-5-9-16(14)20-12-19-11-17(15)20/h4-5,8-9,11-13,15H,1-3,6-7,10H2
Reactome pathway
US Patent
n/an/a<100n/an/an/an/an/an/a
NewLink Genetics Corporation
US Patent
Assay Description
The IC50 values for each compound were determined by testing the activity of TDO in a mixture containing 50 mM potassium phosphate buffer at pH 6.5; ...
US Patent US9617272 (2017)
BindingDB Entry DOI: 10.7270/Q2HD7XQN