BDBM31728 6,8-bis(chloranyl)-3a,4,5,9b-tetrahydro-3H-cyclopenta[c]quinoline-4-carboxylic acid::6,8-dichloro-3a,4,5,9b-tetrahydro-3H-cyclopenta[c]quinoline-4-carboxylic acid::MLS-0111558.0001::cid_2865731
SMILES: OC(=O)C1Nc2c(Cl)cc(Cl)cc2C2C=CCC12
InChI Key: InChIKey=CBSRXMMJHDMLKI-UHFFFAOYSA-N
Data: 5 IC50  1 EC50
Activity Spreadsheet -- Enzyme Inhibition Constant Data from BindingDB
Found 6 hits for monomerid = 31728
Trg + Lig
Ki
nM
ΔG°
kcal/mole
IC50
nM
Kd
nM
EC50/IC50
nM
koff
s-1
kon
M-1s-1
pHTemp
°C
MKP-3
(Rattus norvegicus)
BDBM31728
(6,8-bis(chloranyl)-3a,4,5,9b-tetrahydro-3H-cyclope...)
Show SMILES OC(=O)C1Nc2c(Cl)cc(Cl)cc2C2C=CCC12 |c:15|
Show InChI InChI=1S/C13H11Cl2NO2/c14-6-4-9-7-2-1-3-8(7)12(13(17)18)16-11(9)10(15)5-6/h1-2,4-5,7-8,12,16H,3H2,(H,17,18)
Reactome pathway
PCBioAssay
n/an/a 5.30E+4n/an/an/an/a7.023
Burnham Center for Chemical Genomics
Curated by PubChem BioAssay
Assay Description
Data Source: Burnham Center for Chemical Genomics (BCCG) Source Affiliation: Burnham Institute for Medical Research (BIMR, La Jolla, CA) Network: NIH...
PubChem Bioassay (2008)
BindingDB Entry DOI: 10.7270/Q2N87841
MKP-3
(Rattus norvegicus)
BDBM31728
(6,8-bis(chloranyl)-3a,4,5,9b-tetrahydro-3H-cyclope...)
Show SMILES OC(=O)C1Nc2c(Cl)cc(Cl)cc2C2C=CCC12 |c:15|
Show InChI InChI=1S/C13H11Cl2NO2/c14-6-4-9-7-2-1-3-8(7)12(13(17)18)16-11(9)10(15)5-6/h1-2,4-5,7-8,12,16H,3H2,(H,17,18)
Reactome pathway
PCBioAssay
n/an/a 6.35E+4n/an/an/an/an/an/a
Burnham Center for Chemical Genomics
Curated by PubChem BioAssay
Assay Description
Data Source: Sanford-Burnham Center for Chemical Genomics (SBCCG) Source Affiliation: Sanford-Burnham Medical Research Institute(SBMRI, San Diego, CA...
PubChem Bioassay (2008)
BindingDB Entry DOI: 10.7270/Q25H7DPX
Phospholipase A2
(Homo sapiens (Human))
BDBM31728
(6,8-bis(chloranyl)-3a,4,5,9b-tetrahydro-3H-cyclope...)
Show SMILES OC(=O)C1Nc2c(Cl)cc(Cl)cc2C2C=CCC12 |c:15|
Show InChI InChI=1S/C13H11Cl2NO2/c14-6-4-9-7-2-1-3-8(7)12(13(17)18)16-11(9)10(15)5-6/h1-2,4-5,7-8,12,16H,3H2,(H,17,18)
Reactome pathway
PCBioAssay
n/an/a 9.08E+3n/an/an/an/an/an/a
Burnham Center for Chemical Genomics
Curated by PubChem BioAssay
Assay Description
Data Source: Sanford-Burnham Center for Chemical Genomics (SBCCG) Source Affiliation: Sanford-Burnham Medical Research Institute (SBMRI, San Diego, C...
PubChem Bioassay (2011)
BindingDB Entry DOI: 10.7270/Q26M35BC
Hematopoietic protein-tyrosine phosphatase (HEPTP)
(Homo sapiens (Human))
BDBM31728
(6,8-bis(chloranyl)-3a,4,5,9b-tetrahydro-3H-cyclope...)
Show SMILES OC(=O)C1Nc2c(Cl)cc(Cl)cc2C2C=CCC12 |c:15|
Show InChI InChI=1S/C13H11Cl2NO2/c14-6-4-9-7-2-1-3-8(7)12(13(17)18)16-11(9)10(15)5-6/h1-2,4-5,7-8,12,16H,3H2,(H,17,18)
PCBioAssay
n/an/a 4.20E+4n/an/an/an/an/an/a
Burnham Center for Chemical Genomics
Curated by PubChem BioAssay
Assay Description
Data Source: Sanford-Burnham Center for Chemical Genomics (SBCCG) Source Affiliation: Sanford-Burnham Medical Research Institute (SBMRI, San Diego, C...
PubChem Bioassay (2009)
BindingDB Entry DOI: 10.7270/Q2474894
cysteine protease ATG4B isoform a
(Homo sapiens (Human))
BDBM31728
(6,8-bis(chloranyl)-3a,4,5,9b-tetrahydro-3H-cyclope...)
Show SMILES OC(=O)C1Nc2c(Cl)cc(Cl)cc2C2C=CCC12 |c:15|
Show InChI InChI=1S/C13H11Cl2NO2/c14-6-4-9-7-2-1-3-8(7)12(13(17)18)16-11(9)10(15)5-6/h1-2,4-5,7-8,12,16H,3H2,(H,17,18)
PCBioAssay
n/an/a 2.58E+3n/an/an/an/an/an/a
Burnham Center for Chemical Genomics
Curated by PubChem BioAssay
Assay Description
Data Source: Sanford-Burnham Center for Chemical Genomics (SBCCG) Source Affiliation: Sanford-Burnham Medical Research Institute (SBMRI, San Diego, C...
PubChem Bioassay (2011)
BindingDB Entry DOI: 10.7270/Q2BZ64H1
nuclear receptor subfamily 4, group A, member 1
(Homo sapiens (Human))
BDBM31728
(6,8-bis(chloranyl)-3a,4,5,9b-tetrahydro-3H-cyclope...)
Show SMILES OC(=O)C1Nc2c(Cl)cc(Cl)cc2C2C=CCC12 |c:15|
Show InChI InChI=1S/C13H11Cl2NO2/c14-6-4-9-7-2-1-3-8(7)12(13(17)18)16-11(9)10(15)5-6/h1-2,4-5,7-8,12,16H,3H2,(H,17,18)
Reactome pathway
PCBioAssay
n/an/an/an/a 1.03E+3n/an/an/an/a
Sanford-Burnham Center for Chemical Genomics
Curated by PubChem BioAssay
Assay Description
Data Source: Sanford-Burnham Center for Chemical Genomics (SBCCG) Source Affiliation: Sanford-Burnham Medical Research Institute (SBMRI, San Diego, C...
PubChem Bioassay (2008)
BindingDB Entry DOI: 10.7270/Q2R78CMH