BDBM31783 thieno[2,3-d]pyrimidine deriv., 2f
SMILES: CCc1sc2nc(N)[nH]c(=O)c2c1Sc1cc(Cl)cc(Cl)c1
InChI Key: InChIKey=IDCYCGZREFNTJD-UHFFFAOYSA-N
Data: 6 IC50
Activity Spreadsheet -- Enzyme Inhibition Constant Data from BindingDB
Found 6 hits for monomerid = 31783
Trg + Lig
Ki
nM
ΔG°
kcal/mole
IC50
nM
Kd
nM
EC50/IC50
nM
koff
s-1
kon
M-1s-1
pHTemp
°C
Thymidylate synthase
(Homo sapiens (Human))
BDBM31783
(thieno[2,3-d]pyrimidine deriv., 2f)
Show SMILES CCc1sc2nc(N)[nH]c(=O)c2c1Sc1cc(Cl)cc(Cl)c1
Show InChI InChI=1S/C14H11Cl2N3OS2/c1-2-9-11(21-8-4-6(15)3-7(16)5-8)10-12(20)18-14(17)19-13(10)22-9/h3-5H,2H2,1H3,(H3,17,18,19,20)
NCI pathway
Reactome pathway
n/an/a 690n/an/an/an/a7.430
Duquesne University
Assay Description
TS was assayed spectrophotometrically in the reaction buffer solution containing (6R, 6S)-5, 10-CH2H4folate. The reaction was initiated by the additi...
J Med Chem 52: 4892-902 (2009)
Article DOI: 10.1021/jm900490a
BindingDB Entry DOI: 10.7270/Q2CR5RPK
Thymidylate Synthase (TS)
(Escherichia coli)
BDBM31783
(thieno[2,3-d]pyrimidine deriv., 2f)
Show SMILES CCc1sc2nc(N)[nH]c(=O)c2c1Sc1cc(Cl)cc(Cl)c1
Show InChI InChI=1S/C14H11Cl2N3OS2/c1-2-9-11(21-8-4-6(15)3-7(16)5-8)10-12(20)18-14(17)19-13(10)22-9/h3-5H,2H2,1H3,(H3,17,18,19,20)
n/an/a 1.20E+3n/an/an/an/a7.430
Duquesne University
Assay Description
TS was assayed spectrophotometrically in the reaction buffer solution containing (6R, 6S)-5, 10-CH2H4folate. The reaction was initiated by the additi...
J Med Chem 52: 4892-902 (2009)
Article DOI: 10.1021/jm900490a
BindingDB Entry DOI: 10.7270/Q2CR5RPK
Dihydrofolate reductase (DHFR)
(Toxoplasma gondii)
BDBM31783
(thieno[2,3-d]pyrimidine deriv., 2f)
Show SMILES CCc1sc2nc(N)[nH]c(=O)c2c1Sc1cc(Cl)cc(Cl)c1
Show InChI InChI=1S/C14H11Cl2N3OS2/c1-2-9-11(21-8-4-6(15)3-7(16)5-8)10-12(20)18-14(17)19-13(10)22-9/h3-5H,2H2,1H3,(H3,17,18,19,20)
n/an/a 14n/an/an/an/an/an/a
Duquesne University
Assay Description
DHFRs were assayed spectrophotometrically in the reaction buffer solution containing dihydrofolate. The reaction was initiated with an amount of enzy...
J Med Chem 52: 4892-902 (2009)
Article DOI: 10.1021/jm900490a
BindingDB Entry DOI: 10.7270/Q2CR5RPK
Dihydrofolate reductase
(Homo sapiens (Human))
BDBM31783
(thieno[2,3-d]pyrimidine deriv., 2f)
Show SMILES CCc1sc2nc(N)[nH]c(=O)c2c1Sc1cc(Cl)cc(Cl)c1
Show InChI InChI=1S/C14H11Cl2N3OS2/c1-2-9-11(21-8-4-6(15)3-7(16)5-8)10-12(20)18-14(17)19-13(10)22-9/h3-5H,2H2,1H3,(H3,17,18,19,20)
NCI pathway
Reactome pathway
n/an/a 280n/an/an/an/an/an/a
Duquesne University
Assay Description
DHFRs were assayed spectrophotometrically in the reaction buffer solution containing dihydrofolate. The reaction was initiated with an amount of enzy...
J Med Chem 52: 4892-902 (2009)
Article DOI: 10.1021/jm900490a
BindingDB Entry DOI: 10.7270/Q2CR5RPK
Dihydrofolate Reductase (DHFR)
(Escherichia coli)
BDBM31783
(thieno[2,3-d]pyrimidine deriv., 2f)
Show SMILES CCc1sc2nc(N)[nH]c(=O)c2c1Sc1cc(Cl)cc(Cl)c1
Show InChI InChI=1S/C14H11Cl2N3OS2/c1-2-9-11(21-8-4-6(15)3-7(16)5-8)10-12(20)18-14(17)19-13(10)22-9/h3-5H,2H2,1H3,(H3,17,18,19,20)
n/an/a>2.80E+3n/an/an/an/an/an/a
Duquesne University
Assay Description
DHFRs were assayed spectrophotometrically in the reaction buffer solution containing dihydrofolate. The reaction was initiated with an amount of enzy...
J Med Chem 52: 4892-902 (2009)
Article DOI: 10.1021/jm900490a
BindingDB Entry DOI: 10.7270/Q2CR5RPK
Dihydrofolate reductase (DHFR)
(Toxoplasma gondii)
BDBM31783
(thieno[2,3-d]pyrimidine deriv., 2f)
Show SMILES CCc1sc2nc(N)[nH]c(=O)c2c1Sc1cc(Cl)cc(Cl)c1
Show InChI InChI=1S/C14H11Cl2N3OS2/c1-2-9-11(21-8-4-6(15)3-7(16)5-8)10-12(20)18-14(17)19-13(10)22-9/h3-5H,2H2,1H3,(H3,17,18,19,20)
n/an/a 1.60E+3n/an/an/an/an/an/a
Duquesne University
Assay Description
TS was assayed spectrophotometrically in the reaction buffer solution containing (6R, 6S)-5, 10-CH2H4folate. The reaction was initiated by the additi...
J Med Chem 52: 4892-902 (2009)
Article DOI: 10.1021/jm900490a
BindingDB Entry DOI: 10.7270/Q2CR5RPK