null
SMILES: CCS(=O)(=O)c1ccc(CNC(=O)c2cnc3[C@H](C(C)C)N(Cc4ccc(cc4)C#N)Cc3c2)cc1
InChI Key: InChIKey=FFZUYRFIFPUASY-MHZLTWQESA-N
Activity Spreadsheet -- Enzyme Inhibition Constant Data from BindingDB
Found 5 hits for monomerid = 317851
Trg + Lig
Ki
nM
ΔG°
kcal/mole
IC50
nM
Kd
nM
EC50/IC50
nM
koff
s-1
kon
M-1s-1
pHTemp
°C
Nuclear receptor ROR-gamma
(Homo sapiens (Human))
BDBM317851
(US10399976, Compound 4 | US10807980, Compound 4 | ...)
Show SMILES CCS(=O)(=O)c1ccc(CNC(=O)c2cnc3[C@H](C(C)C)N(Cc4ccc(cc4)C#N)Cc3c2)cc1 |r|
Show InChI InChI=1S/C28H30N4O3S/c1-4-36(34,35)25-11-9-21(10-12-25)15-31-28(33)23-13-24-18-32(27(19(2)3)26(24)30-16-23)17-22-7-5-20(14-29)6-8-22/h5-13,16,19,27H,4,15,17-18H2,1-3H3,(H,31,33)/t27-/m0/s1
US Patent
<100n/an/an/an/an/an/an/an/a
Vitae Pharmaceuticals, LLC
US Patent
Assay Description
Compounds of the present invention were tested for ability to bind to RORγ in a cell-free competition assay with commercially available radio-li...
US Patent US10807980 (2020)
Nuclear receptor ROR-gamma
(Homo sapiens (Human))
BDBM317851
(US10399976, Compound 4 | US10807980, Compound 4 | ...)
Show SMILES CCS(=O)(=O)c1ccc(CNC(=O)c2cnc3[C@H](C(C)C)N(Cc4ccc(cc4)C#N)Cc3c2)cc1 |r|
Show InChI InChI=1S/C28H30N4O3S/c1-4-36(34,35)25-11-9-21(10-12-25)15-31-28(33)23-13-24-18-32(27(19(2)3)26(24)30-16-23)17-22-7-5-20(14-29)6-8-22/h5-13,16,19,27H,4,15,17-18H2,1-3H3,(H,31,33)/t27-/m0/s1
US Patent
<100n/an/an/an/an/an/an/an/a
Vitae Pharmaceuticals, LLC
US Patent
Assay Description
Compounds of the present invention were tested for ability to bind to ROR gamma in a cell-free competition assay with commercially available radio-li...
US Patent US10399976 (2019)
BindingDB Entry DOI: 10.7270/Q2F76FXT
Nuclear receptor ROR-gamma
(Homo sapiens (Human))
BDBM317851
(US10399976, Compound 4 | US10807980, Compound 4 | ...)
Show SMILES CCS(=O)(=O)c1ccc(CNC(=O)c2cnc3[C@H](C(C)C)N(Cc4ccc(cc4)C#N)Cc3c2)cc1 |r|
Show InChI InChI=1S/C28H30N4O3S/c1-4-36(34,35)25-11-9-21(10-12-25)15-31-28(33)23-13-24-18-32(27(19(2)3)26(24)30-16-23)17-22-7-5-20(14-29)6-8-22/h5-13,16,19,27H,4,15,17-18H2,1-3H3,(H,31,33)/t27-/m0/s1
US Patent
<100n/an/an/an/an/an/an/an/a
Vitae Pharmaceuticals, Inc.
US Patent
Assay Description
Compounds of the present invention were tested for ability to bind to RORγ in a cell-free competition assay with commercially available radio-li...
US Patent US9624217 (2017)
BindingDB Entry DOI: 10.7270/Q29P33RJ
Nuclear receptor ROR-gamma
(Homo sapiens (Human))
BDBM317851
(US10399976, Compound 4 | US10807980, Compound 4 | ...)
Show SMILES CCS(=O)(=O)c1ccc(CNC(=O)c2cnc3[C@H](C(C)C)N(Cc4ccc(cc4)C#N)Cc3c2)cc1 |r|
Show InChI InChI=1S/C28H30N4O3S/c1-4-36(34,35)25-11-9-21(10-12-25)15-31-28(33)23-13-24-18-32(27(19(2)3)26(24)30-16-23)17-22-7-5-20(14-29)6-8-22/h5-13,16,19,27H,4,15,17-18H2,1-3H3,(H,31,33)/t27-/m0/s1
US Patent
n/an/a<100n/an/an/an/an/an/a
Vitae Pharmaceuticals, LLC
US Patent
Assay Description
Compounds of the present invention were tested for RORγ inverse agonist activity in a cell-based, transcriptional activity assay. Secreted Nanol...
US Patent US10807980 (2020)
Nuclear receptor ROR-gamma
(Homo sapiens (Human))
BDBM317851
(US10399976, Compound 4 | US10807980, Compound 4 | ...)
Show SMILES CCS(=O)(=O)c1ccc(CNC(=O)c2cnc3[C@H](C(C)C)N(Cc4ccc(cc4)C#N)Cc3c2)cc1 |r|
Show InChI InChI=1S/C28H30N4O3S/c1-4-36(34,35)25-11-9-21(10-12-25)15-31-28(33)23-13-24-18-32(27(19(2)3)26(24)30-16-23)17-22-7-5-20(14-29)6-8-22/h5-13,16,19,27H,4,15,17-18H2,1-3H3,(H,31,33)/t27-/m0/s1
US Patent
n/an/a<100n/an/an/an/an/an/a
Vitae Pharmaceuticals, LLC
US Patent
Assay Description
Compounds of the present invention were tested for ROR gamma inverse agonist activity in a cell-based, transcriptional activity assay. Secreted Nanol...
US Patent US10399976 (2019)
BindingDB Entry DOI: 10.7270/Q2F76FXT