null
SMILES: CCS(=O)(=O)c1ccc(CNC(=O)c2cnc3[C@H](C(C)C)N(Cc4ccc(nc4)C(F)(F)F)Cc3c2)cc1
InChI Key: InChIKey=WTVHYFGEWDHALB-VWLOTQADSA-N
Activity Spreadsheet -- Enzyme Inhibition Constant Data from BindingDB
Found 5 hits for monomerid = 317886
Trg + Lig
Ki
nM
ΔG°
kcal/mole
IC50
nM
Kd
nM
EC50/IC50
nM
koff
s-1
kon
M-1s-1
pHTemp
°C
Nuclear receptor ROR-gamma
(Homo sapiens (Human))
BDBM317886
(US10399976, Compound 39 | US10807980, Compound 39 ...)
Show SMILES CCS(=O)(=O)c1ccc(CNC(=O)c2cnc3[C@H](C(C)C)N(Cc4ccc(nc4)C(F)(F)F)Cc3c2)cc1 |r|
Show InChI InChI=1S/C27H29F3N4O3S/c1-4-38(36,37)22-8-5-18(6-9-22)12-33-26(35)20-11-21-16-34(25(17(2)3)24(21)32-14-20)15-19-7-10-23(31-13-19)27(28,29)30/h5-11,13-14,17,25H,4,12,15-16H2,1-3H3,(H,33,35)/t25-/m0/s1
US Patent
<100n/an/an/an/an/an/an/an/a
Vitae Pharmaceuticals, LLC
US Patent
Assay Description
Compounds of the present invention were tested for ability to bind to RORγ in a cell-free competition assay with commercially available radio-li...
US Patent US10807980 (2020)
Nuclear receptor ROR-gamma
(Homo sapiens (Human))
BDBM317886
(US10399976, Compound 39 | US10807980, Compound 39 ...)
Show SMILES CCS(=O)(=O)c1ccc(CNC(=O)c2cnc3[C@H](C(C)C)N(Cc4ccc(nc4)C(F)(F)F)Cc3c2)cc1 |r|
Show InChI InChI=1S/C27H29F3N4O3S/c1-4-38(36,37)22-8-5-18(6-9-22)12-33-26(35)20-11-21-16-34(25(17(2)3)24(21)32-14-20)15-19-7-10-23(31-13-19)27(28,29)30/h5-11,13-14,17,25H,4,12,15-16H2,1-3H3,(H,33,35)/t25-/m0/s1
US Patent
<100n/an/an/an/an/an/an/an/a
Vitae Pharmaceuticals, LLC
US Patent
Assay Description
Compounds of the present invention were tested for ability to bind to ROR gamma in a cell-free competition assay with commercially available radio-li...
US Patent US10399976 (2019)
BindingDB Entry DOI: 10.7270/Q2F76FXT
Nuclear receptor ROR-gamma
(Homo sapiens (Human))
BDBM317886
(US10399976, Compound 39 | US10807980, Compound 39 ...)
Show SMILES CCS(=O)(=O)c1ccc(CNC(=O)c2cnc3[C@H](C(C)C)N(Cc4ccc(nc4)C(F)(F)F)Cc3c2)cc1 |r|
Show InChI InChI=1S/C27H29F3N4O3S/c1-4-38(36,37)22-8-5-18(6-9-22)12-33-26(35)20-11-21-16-34(25(17(2)3)24(21)32-14-20)15-19-7-10-23(31-13-19)27(28,29)30/h5-11,13-14,17,25H,4,12,15-16H2,1-3H3,(H,33,35)/t25-/m0/s1
US Patent
<100n/an/an/an/an/an/an/an/a
Vitae Pharmaceuticals, Inc.
US Patent
Assay Description
Compounds of the present invention were tested for ability to bind to RORγ in a cell-free competition assay with commercially available radio-li...
US Patent US9624217 (2017)
BindingDB Entry DOI: 10.7270/Q29P33RJ
Nuclear receptor ROR-gamma
(Homo sapiens (Human))
BDBM317886
(US10399976, Compound 39 | US10807980, Compound 39 ...)
Show SMILES CCS(=O)(=O)c1ccc(CNC(=O)c2cnc3[C@H](C(C)C)N(Cc4ccc(nc4)C(F)(F)F)Cc3c2)cc1 |r|
Show InChI InChI=1S/C27H29F3N4O3S/c1-4-38(36,37)22-8-5-18(6-9-22)12-33-26(35)20-11-21-16-34(25(17(2)3)24(21)32-14-20)15-19-7-10-23(31-13-19)27(28,29)30/h5-11,13-14,17,25H,4,12,15-16H2,1-3H3,(H,33,35)/t25-/m0/s1
US Patent
n/an/a<100n/an/an/an/an/an/a
Vitae Pharmaceuticals, LLC
US Patent
Assay Description
Compounds of the present invention were tested for RORγ inverse agonist activity in a cell-based, transcriptional activity assay. Secreted Nanol...
US Patent US10807980 (2020)
Nuclear receptor ROR-gamma
(Homo sapiens (Human))
BDBM317886
(US10399976, Compound 39 | US10807980, Compound 39 ...)
Show SMILES CCS(=O)(=O)c1ccc(CNC(=O)c2cnc3[C@H](C(C)C)N(Cc4ccc(nc4)C(F)(F)F)Cc3c2)cc1 |r|
Show InChI InChI=1S/C27H29F3N4O3S/c1-4-38(36,37)22-8-5-18(6-9-22)12-33-26(35)20-11-21-16-34(25(17(2)3)24(21)32-14-20)15-19-7-10-23(31-13-19)27(28,29)30/h5-11,13-14,17,25H,4,12,15-16H2,1-3H3,(H,33,35)/t25-/m0/s1
US Patent
n/an/a<100n/an/an/an/an/an/a
Vitae Pharmaceuticals, LLC
US Patent
Assay Description
Compounds of the present invention were tested for ROR gamma inverse agonist activity in a cell-based, transcriptional activity assay. Secreted Nanol...
US Patent US10399976 (2019)
BindingDB Entry DOI: 10.7270/Q2F76FXT