BDBM31794 2-aminobenzimidazole deriv., 4::5-Chloro-1H-benzoimidazol-2-ylamine::5-chloro-1H-benzo[d]imidazol-2-amine::6-chloro-1H-benzimidazol-2-amine::6-chloro-1H-benzo[d]imidazol-2-amine::CHEMBL269158
SMILES: Nc1nc2ccc(Cl)cc2[nH]1
InChI Key: InChIKey=PDOCNPCPPLPXRV-UHFFFAOYSA-N
Data: 1 KI  1 IC50
PDB links: 2 PDB IDs match this monomer.
Activity Spreadsheet -- Enzyme Inhibition Constant Data from BindingDB
Found 2 hits for monomerid = 31794
Trg + Lig
Ki
nM
ΔG°
kcal/mole
IC50
nM
Kd
nM
EC50/IC50
nM
koff
s-1
kon
M-1s-1
pHTemp
°C
Pteridine Reductase 1 (PTR1)
(Trypanosoma brucei brucei)
BDBM31794
(2-aminobenzimidazole deriv., 4 | 5-Chloro-1H-benzo...)
Show SMILES Nc1nc2ccc(Cl)cc2[nH]1
Show InChI InChI=1S/C7H6ClN3/c8-4-1-2-5-6(3-4)11-7(9)10-5/h1-3H,(H3,9,10,11)
1.06E+4 -6.74n/an/an/an/an/a6.023
University of Dundee
Assay Description
TbPTR1 activity was measured in 96-well microtiter plates via reduction of cytochrome c (cytc) as a result of the enzymatic production of tetrahydrob...
J Med Chem 52: 4454-65 (2009)
Article DOI: 10.1021/jm900414x
BindingDB Entry DOI: 10.7270/Q28050X3
3D
3D Structure (crystal)
Beta-secretase 1
(Homo sapiens (Human))
BDBM31794
(2-aminobenzimidazole deriv., 4 | 5-Chloro-1H-benzo...)
Show SMILES Nc1nc2ccc(Cl)cc2[nH]1
Show InChI InChI=1S/C7H6ClN3/c8-4-1-2-5-6(3-4)11-7(9)10-5/h1-3H,(H3,9,10,11)
n/an/a 7.31E+5n/an/an/an/an/an/a
Evotec UK Ltd
Curated by ChEMBL
Assay Description
Inhibition of BACE1 assessed as amyloid beta secretion by cell based assay
Bioorg Med Chem Lett 20: 5329-33 (2010)
Article DOI: 10.1016/j.bmcl.2010.06.089
BindingDB Entry DOI: 10.7270/Q2VQ32W7