BDBM31799 2-aminobenzimidazole deriv., 10
SMILES: Nc1nc2cccc(Cl)c2n1Cc1ccc(Cl)c(Cl)c1
InChI Key: InChIKey=JGIMDXAWKSVXJR-UHFFFAOYSA-N
Data: 1 KI
Activity Spreadsheet -- Enzyme Inhibition Constant Data from BindingDB
Found 1 hit for monomerid = 31799
Trg + Lig
Ki
nM
ΔG°
kcal/mole
IC50
nM
Kd
nM
EC50/IC50
nM
koff
s-1
kon
M-1s-1
pHTemp
°C
Pteridine Reductase 1 (PTR1)
(Trypanosoma brucei brucei)
BDBM31799
(2-aminobenzimidazole deriv., 10)
Show SMILES Nc1nc2cccc(Cl)c2n1Cc1ccc(Cl)c(Cl)c1
Show InChI InChI=1S/C14H10Cl3N3/c15-9-5-4-8(6-11(9)17)7-20-13-10(16)2-1-3-12(13)19-14(20)18/h1-6H,7H2,(H2,18,19)
510 -8.52n/an/an/an/an/a6.023
University of Dundee
Assay Description
TbPTR1 activity was measured in 96-well microtiter plates via reduction of cytochrome c (cytc) as a result of the enzymatic production of tetrahydrob...
J Med Chem 52: 4454-65 (2009)
Article DOI: 10.1021/jm900414x
BindingDB Entry DOI: 10.7270/Q28050X3
3D
3D Structure (docked)