BDBM3180 3-[1-(4-Amidinobutyl)-3-indolyl]-4-(1-methyl-3-indolyl)-1H-pyrrole-2,5-dione::5-{3-[4-(1-methyl-1H-indol-3-yl)-2,5-dioxo-2,5-dihydro-1H-pyrrol-3-yl]-1H-indol-1-yl}pentanimidamide::Bisindolylmaleimide 15::ROCHE screening, 54
SMILES: Cn1cc(C2=C(C(=O)NC2=O)c2cn(CCCCC(N)=N)c3ccccc23)c2ccccc12
InChI Key: InChIKey=XIFBOSNPWOEMFB-UHFFFAOYSA-N
Data: 3 IC50
PDB links: 9 PDB IDs contain inhibitors having a similarity of 90% to this monomer.
Activity Spreadsheet -- Enzyme Inhibition Constant Data from BindingDB
Found 3 hits for monomerid = 3180
Trg + Lig
Ki
nM
ΔG°
kcal/mole
IC50
nM
Kd
nM
EC50/IC50
nM
koff
s-1
kon
M-1s-1
pHTemp
°C
Protein Kinase C
(Rattus norvegicus (rat))
BDBM3180
(3-[1-(4-Amidinobutyl)-3-indolyl]-4-(1-methyl-3-ind...)
Show SMILES Cn1cc(C2=C(C(=O)NC2=O)c2cn(CCCCC(N)=N)c3ccccc23)c2ccccc12 |t:4|
Show InChI InChI=1S/C26H25N5O2/c1-30-14-18(16-8-2-4-10-20(16)30)23-24(26(33)29-25(23)32)19-15-31(13-7-6-12-22(27)28)21-11-5-3-9-17(19)21/h2-5,8-11,14-15H,6-7,12-13H2,1H3,(H3,27,28)(H,29,32,33)
n/an/a 31n/an/an/an/an/an/a
Roche Products Limited
Assay Description
The activity of PKC, activated by phosphatidylerine and Ca2+, is measured by its ability to transfer phosphate from [gamma-32P]ATP to lysine-rich his...
J Med Chem 35: 994-1001 (1992)
Article DOI: 10.1021/jm00084a004
BindingDB Entry DOI: 10.7270/Q2M043KK
Protein cereblon/Serine/threonine-protein kinase TBK1
(Homo sapiens (Human))
BDBM3180
(3-[1-(4-Amidinobutyl)-3-indolyl]-4-(1-methyl-3-ind...)
Show SMILES Cn1cc(C2=C(C(=O)NC2=O)c2cn(CCCCC(N)=N)c3ccccc23)c2ccccc12 |t:4|
Show InChI InChI=1S/C26H25N5O2/c1-30-14-18(16-8-2-4-10-20(16)30)23-24(26(33)29-25(23)32)19-15-31(13-7-6-12-22(27)28)21-11-5-3-9-17(19)21/h2-5,8-11,14-15H,6-7,12-13H2,1H3,(H3,27,28)(H,29,32,33)
n/an/a 800n/an/an/an/an/an/a
Technical University of Dortmund
Assay Description
IC50 determinations for TBK1 were performed with the KinEASE-STK assay from Cisbio according to the manufacturer's instructions. A biotinylated s...
ACS Chem Biol 10: 289-98 (2015)
Article DOI: 10.1021/cb500908d
BindingDB Entry DOI: 10.7270/Q2WH2NRB
cAMP-Dependent Protein Kinase (PKA)
(Bos taurus (bovine))
BDBM3180
(3-[1-(4-Amidinobutyl)-3-indolyl]-4-(1-methyl-3-ind...)
Show SMILES Cn1cc(C2=C(C(=O)NC2=O)c2cn(CCCCC(N)=N)c3ccccc23)c2ccccc12 |t:4|
Show InChI InChI=1S/C26H25N5O2/c1-30-14-18(16-8-2-4-10-20(16)30)23-24(26(33)29-25(23)32)19-15-31(13-7-6-12-22(27)28)21-11-5-3-9-17(19)21/h2-5,8-11,14-15H,6-7,12-13H2,1H3,(H3,27,28)(H,29,32,33)
n/an/a 7.40E+3n/an/an/an/an/an/a
Roche Products Limited
Assay Description
The activity of PKA, activated by cAMP, is measured by its ability to transfer phosphate from [gamma-32P]ATP to histone.
J Med Chem 35: 994-1001 (1992)
Article DOI: 10.1021/jm00084a004
BindingDB Entry DOI: 10.7270/Q2M043KK