BDBM31819 methyl-2-pyrrolidinone, 20b
SMILES: [H][C@]1(C[C@]2([H])CCO[C@]2([H])C1)OC(=O)N[C@@H](Cc1ccccc1)[C@H](O)CN(C[C@H]1CCC(=O)N1)S(=O)(=O)c1ccc(N)cc1
InChI Key: InChIKey=JDRVPGSLOAYAKV-SJJWNOTFSA-N
Data: 1 KI
Activity Spreadsheet -- Enzyme Inhibition Constant Data from BindingDB
Found 1 hit for monomerid = 31819
Trg + Lig
Ki
nM
ΔG°
kcal/mole
IC50
nM
Kd
nM
EC50/IC50
nM
koff
s-1
kon
M-1s-1
pHTemp
°C
HIV-1 Protease
(Human immunodeficiency virus type 1)
BDBM31819
(methyl-2-pyrrolidinone, 20b)
Show SMILES [H][C@]1(C[C@]2([H])CCO[C@]2([H])C1)OC(=O)N[C@@H](Cc1ccccc1)[C@H](O)CN(C[C@H]1CCC(=O)N1)S(=O)(=O)c1ccc(N)cc1 |r|
Show InChI InChI=1S/C29H38N4O7S/c30-21-6-9-24(10-7-21)41(37,38)33(17-22-8-11-28(35)31-22)18-26(34)25(14-19-4-2-1-3-5-19)32-29(36)40-23-15-20-12-13-39-27(20)16-23/h1-7,9-10,20,22-23,25-27,34H,8,11-18,30H2,(H,31,35)(H,32,36)/t20-,22+,23+,25-,26+,27+/m0/s1
0.310 -13.0n/an/an/an/an/a6.425
Purdue University
Assay Description
The Ki values were determined by substrate cleavage assay using fluorogenic substrate, 2-(aminobenzoyl)-Thr-Ile-Nle-Phe(p-NO2)-Gln-Arg-NH2. A standar...
J Med Chem 52: 3902-14 (2009)
Article DOI: 10.1021/jm900303m
BindingDB Entry DOI: 10.7270/Q20G3HHH