BDBM31821 oxazolidinone, 30
SMILES: [H][C@@]1(CO[C@@]2([H])OCC[C@@]12[H])OC(=O)N[C@@H](Cc1ccccc1)[C@H](O)CN(C[C@@H]1COC(=O)N1)S(=O)(=O)c1ccc(N)cc1
InChI Key: InChIKey=GALIUMNDNZPWAA-RHIKPPAFSA-N
Data: 1 KI
Activity Spreadsheet -- Enzyme Inhibition Constant Data from BindingDB
Found 1 hit for monomerid = 31821
Trg + Lig
Ki
nM
ΔG°
kcal/mole
IC50
nM
Kd
nM
EC50/IC50
nM
koff
s-1
kon
M-1s-1
pHTemp
°C
HIV-1 Protease
(Human immunodeficiency virus type 1)
BDBM31821
(oxazolidinone, 30)
Show SMILES [H][C@@]1(CO[C@@]2([H])OCC[C@@]12[H])OC(=O)N[C@@H](Cc1ccccc1)[C@H](O)CN(C[C@@H]1COC(=O)N1)S(=O)(=O)c1ccc(N)cc1 |r|
Show InChI InChI=1S/C27H34N4O9S/c28-18-6-8-20(9-7-18)41(35,36)31(13-19-15-39-26(33)29-19)14-23(32)22(12-17-4-2-1-3-5-17)30-27(34)40-24-16-38-25-21(24)10-11-37-25/h1-9,19,21-25,32H,10-16,28H2,(H,29,33)(H,30,34)/t19-,21+,22+,23-,24+,25-/m1/s1
0.310 -13.0n/an/an/an/an/a6.425
Purdue University
Assay Description
The Ki values were determined by substrate cleavage assay using fluorogenic substrate, 2-(aminobenzoyl)-Thr-Ile-Nle-Phe(p-NO2)-Gln-Arg-NH2. A standar...
J Med Chem 52: 3902-14 (2009)
Article DOI: 10.1021/jm900303m
BindingDB Entry DOI: 10.7270/Q20G3HHH