BDBM31829 RL46::quinazoline-pyrazolourea hybrid compound, 3c
SMILES: CCC(=O)Nc1ccc2ncnc(Nc3ccc(NC(=O)Nc4cc(nn4-c4cccc(C)c4)C(C)(C)C)cc3)c2c1
InChI Key: InChIKey=FQVDDJWQBNAYCH-UHFFFAOYSA-N
Data: 6 IC50  1 Kd
Activity Spreadsheet -- Enzyme Inhibition Constant Data from BindingDB
Found 6 hits for monomerid = 31829
Trg + Lig
Ki
nM
ΔG°
kcal/mole
IC50
nM
Kd
nM
EC50/IC50
nM
koff
s-1
kon
M-1s-1
pHTemp
°C
Tyrosine-protein kinase ABL1
(Homo sapiens (Human))
BDBM31829
(RL46 | quinazoline-pyrazolourea hybrid compound, 3...)
Show SMILES CCC(=O)Nc1ccc2ncnc(Nc3ccc(NC(=O)Nc4cc(nn4-c4cccc(C)c4)C(C)(C)C)cc3)c2c1
Show InChI InChI=1S/C32H34N8O2/c1-6-29(41)35-23-14-15-26-25(17-23)30(34-19-33-26)36-21-10-12-22(13-11-21)37-31(42)38-28-18-27(32(3,4)5)39-40(28)24-9-7-8-20(2)16-24/h7-19H,6H2,1-5H3,(H,35,41)(H,33,34,36)(H2,37,38,42)
Reactome pathway
n/an/a 388n/an/an/an/an/an/a
Technical University of Dortmund
Curated by ChEMBL
Assay Description
Inhibition of human wild-type ABL (Ser229 to Gln513)-mediated phosphorylation of biotinylated poly-Glu-Tyr expressed in Escherichia coli BL21(DE3) pr...
J Med Chem 56: 5757-72 (2014)
Article DOI: 10.1021/jm4004076
BindingDB Entry DOI: 10.7270/Q2W37XPH
Proto-oncogene tyrosine-protein kinase Src
(Gallus gallus (Chicken))
BDBM31829
(RL46 | quinazoline-pyrazolourea hybrid compound, 3...)
Show SMILES CCC(=O)Nc1ccc2ncnc(Nc3ccc(NC(=O)Nc4cc(nn4-c4cccc(C)c4)C(C)(C)C)cc3)c2c1
Show InChI InChI=1S/C32H34N8O2/c1-6-29(41)35-23-14-15-26-25(17-23)30(34-19-33-26)36-21-10-12-22(13-11-21)37-31(42)38-28-18-27(32(3,4)5)39-40(28)24-9-7-8-20(2)16-24/h7-19H,6H2,1-5H3,(H,35,41)(H,33,34,36)(H2,37,38,42)
n/an/a 14n/an/an/an/an/an/a
Technical University of Dortmund
Curated by ChEMBL
Assay Description
Inhibition of chicken wild-type cSRC (251 to 533)-mediated phosphorylation of biotinylated poly-Glu-Tyr expressed in Escherichia coli BL21(DE3) prein...
J Med Chem 56: 5757-72 (2014)
Article DOI: 10.1021/jm4004076
BindingDB Entry DOI: 10.7270/Q2W37XPH
Mitogen-activated protein kinase 14
(Homo sapiens (Human))
BDBM31829
(RL46 | quinazoline-pyrazolourea hybrid compound, 3...)
Show SMILES CCC(=O)Nc1ccc2ncnc(Nc3ccc(NC(=O)Nc4cc(nn4-c4cccc(C)c4)C(C)(C)C)cc3)c2c1
Show InChI InChI=1S/C32H34N8O2/c1-6-29(41)35-23-14-15-26-25(17-23)30(34-19-33-26)36-21-10-12-22(13-11-21)37-31(42)38-28-18-27(32(3,4)5)39-40(28)24-9-7-8-20(2)16-24/h7-19H,6H2,1-5H3,(H,35,41)(H,33,34,36)(H2,37,38,42)
NCI pathway
Reactome pathway
n/an/a 1.00E+3n/an/an/an/an/an/a
Chemical Genomics Centre of the Max Planck Society
Curated by ChEMBL
Assay Description
Displacemnt of N,N'-(2,2'-(3,3'-disulfanediylbis(2,5-dioxopyrrolidine-3,1-diyl))bis(ethane-2,1-diyl))bis(2-(3-(3-tert-butyl-5-(3-naphthalen-1-ylureid...
J Med Chem 53: 357-67 (2010)
Article DOI: 10.1021/jm901297e
BindingDB Entry DOI: 10.7270/Q29W0FKC
Src Mutant (T338M)
(Gallus gallus (Chicken))
BDBM31829
(RL46 | quinazoline-pyrazolourea hybrid compound, 3...)
Show SMILES CCC(=O)Nc1ccc2ncnc(Nc3ccc(NC(=O)Nc4cc(nn4-c4cccc(C)c4)C(C)(C)C)cc3)c2c1
Show InChI InChI=1S/C32H34N8O2/c1-6-29(41)35-23-14-15-26-25(17-23)30(34-19-33-26)36-21-10-12-22(13-11-21)37-31(42)38-28-18-27(32(3,4)5)39-40(28)24-9-7-8-20(2)16-24/h7-19H,6H2,1-5H3,(H,35,41)(H,33,34,36)(H2,37,38,42)
n/an/a 23n/an/an/an/a7.023
Chemical Genomics Centre of the Max Planck Society
Assay Description
IC50 determinations for cSrc kinases were measured with the HTRF KinEASE-TK assay from Cisbio according to the manufacturer instructions. A biotinyla...
J Med Chem 52: 3915-26 (2009)
Article DOI: 10.1021/jm9002928
BindingDB Entry DOI: 10.7270/Q2VT1QD3
Mitogen-activated protein kinase 14
(Homo sapiens (Human))
BDBM31829
(RL46 | quinazoline-pyrazolourea hybrid compound, 3...)
Show SMILES CCC(=O)Nc1ccc2ncnc(Nc3ccc(NC(=O)Nc4cc(nn4-c4cccc(C)c4)C(C)(C)C)cc3)c2c1
Show InChI InChI=1S/C32H34N8O2/c1-6-29(41)35-23-14-15-26-25(17-23)30(34-19-33-26)36-21-10-12-22(13-11-21)37-31(42)38-28-18-27(32(3,4)5)39-40(28)24-9-7-8-20(2)16-24/h7-19H,6H2,1-5H3,(H,35,41)(H,33,34,36)(H2,37,38,42)
NCI pathway
Reactome pathway
n/an/a 6.00E+3n/an/an/an/an/an/a
Chemical Genomics Centre of the Max Planck Society
Curated by ChEMBL
Assay Description
Inhibition of p38alpha active form expressed in Escherichia coli BL21(DE3) cells by HTRF assay
J Med Chem 53: 357-67 (2010)
Article DOI: 10.1021/jm901297e
BindingDB Entry DOI: 10.7270/Q29W0FKC
Proto-oncogene tyrosine-protein kinase Src
(Gallus gallus (Chicken))
BDBM31829
(RL46 | quinazoline-pyrazolourea hybrid compound, 3...)
Show SMILES CCC(=O)Nc1ccc2ncnc(Nc3ccc(NC(=O)Nc4cc(nn4-c4cccc(C)c4)C(C)(C)C)cc3)c2c1
Show InChI InChI=1S/C32H34N8O2/c1-6-29(41)35-23-14-15-26-25(17-23)30(34-19-33-26)36-21-10-12-22(13-11-21)37-31(42)38-28-18-27(32(3,4)5)39-40(28)24-9-7-8-20(2)16-24/h7-19H,6H2,1-5H3,(H,35,41)(H,33,34,36)(H2,37,38,42)
n/an/a 14 56n/an/an/a7.023
Chemical Genomics Centre of the Max Planck Society
Assay Description
IC50 determinations for cSrc kinases were measured with the HTRF KinEASE-TK assay from Cisbio according to the manufacturer instructions. A biotinyla...
J Med Chem 52: 3915-26 (2009)
Article DOI: 10.1021/jm9002928
BindingDB Entry DOI: 10.7270/Q2VT1QD3