BDBM31842 2,4-Bisanilinopyrimidine, 49
SMILES: Oc1ccc(Nc2ncc(F)c(Nc3ccc(cc3)C(=O)Nc3ccccc3F)n2)cc1
InChI Key: InChIKey=JTDAPLNYHSQSQY-UHFFFAOYSA-N
Data: 1 IC50
Activity Spreadsheet -- Enzyme Inhibition Constant Data from BindingDB
Found 1 hit for monomerid = 31842
Trg + Lig
Ki
nM
ΔG°
kcal/mole
IC50
nM
Kd
nM
EC50/IC50
nM
koff
s-1
kon
M-1s-1
pHTemp
°C
Aurora kinase A
(Homo sapiens (Human))
BDBM31842
(2,4-Bisanilinopyrimidine, 49)
Show SMILES Oc1ccc(Nc2ncc(F)c(Nc3ccc(cc3)C(=O)Nc3ccccc3F)n2)cc1
Show InChI InChI=1S/C23H17F2N5O2/c24-18-3-1-2-4-20(18)29-22(32)14-5-7-15(8-6-14)27-21-19(25)13-26-23(30-21)28-16-9-11-17(31)12-10-16/h1-13,31H,(H,29,32)(H2,26,27,28,30)
NCI pathway
Reactome pathway
n/an/a 9n/an/an/an/a7.522
Genentech
Assay Description
Aurora kinase was assayed in ELISA format using a GST fusion of the N-terminus of Histone H3 as substrate. Plates were coated with substrate, and the...
J Med Chem 52: 3300-7 (2009)
Article DOI: 10.1021/jm9000314
BindingDB Entry DOI: 10.7270/Q2M90706