BDBM31843 2,4-Bisanilinopyrimidine, 50
SMILES: Oc1ccc(Nc2ncc(F)c(Nc3ccc(cc3)C(=O)Nc3cccc(F)c3)n2)cc1
InChI Key: InChIKey=YUPVGFDKYPJXTL-UHFFFAOYSA-N
Data: 1 IC50
Activity Spreadsheet -- Enzyme Inhibition Constant Data from BindingDB
Found 1 hit for monomerid = 31843
Trg + Lig
Ki
nM
ΔG°
kcal/mole
IC50
nM
Kd
nM
EC50/IC50
nM
koff
s-1
kon
M-1s-1
pHTemp
°C
Aurora kinase A
(Homo sapiens (Human))
BDBM31843
(2,4-Bisanilinopyrimidine, 50)
Show SMILES Oc1ccc(Nc2ncc(F)c(Nc3ccc(cc3)C(=O)Nc3cccc(F)c3)n2)cc1
Show InChI InChI=1S/C23H17F2N5O2/c24-15-2-1-3-18(12-15)28-22(32)14-4-6-16(7-5-14)27-21-20(25)13-26-23(30-21)29-17-8-10-19(31)11-9-17/h1-13,31H,(H,28,32)(H2,26,27,29,30)
NCI pathway
Reactome pathway
n/an/a 59n/an/an/an/a7.522
Genentech
Assay Description
Aurora kinase was assayed in ELISA format using a GST fusion of the N-terminus of Histone H3 as substrate. Plates were coated with substrate, and the...
J Med Chem 52: 3300-7 (2009)
Article DOI: 10.1021/jm9000314
BindingDB Entry DOI: 10.7270/Q2M90706
3D
3D Structure (docked)