BDBM31877 2,4-Bisanilinopyrimidine, 43
SMILES: Cc1ccccc1NC(=O)c1ccc(Nc2nc(Nc3ccc(O)cc3)ncc2F)cc1
InChI Key: InChIKey=HVGRPEROSWDLRR-UHFFFAOYSA-N
Data: 1 IC50
Activity Spreadsheet -- Enzyme Inhibition Constant Data from BindingDB
Found 1 hit for monomerid = 31877
Trg + Lig
Ki
nM
ΔG°
kcal/mole
IC50
nM
Kd
nM
EC50/IC50
nM
koff
s-1
kon
M-1s-1
pHTemp
°C
Aurora kinase A
(Homo sapiens (Human))
BDBM31877
(2,4-Bisanilinopyrimidine, 43)
Show SMILES Cc1ccccc1NC(=O)c1ccc(Nc2nc(Nc3ccc(O)cc3)ncc2F)cc1
Show InChI InChI=1S/C24H20FN5O2/c1-15-4-2-3-5-21(15)29-23(32)16-6-8-17(9-7-16)27-22-20(25)14-26-24(30-22)28-18-10-12-19(31)13-11-18/h2-14,31H,1H3,(H,29,32)(H2,26,27,28,30)
NCI pathway
Reactome pathway
n/an/a 20n/an/an/an/an/an/a
Genentech
Assay Description
Aurora kinase was assayed in ELISA format using a GST fusion of the N-terminus of Histone H3 as substrate. Plates were coated with substrate, and the...
J Med Chem 52: 3300-7 (2009)
Article DOI: 10.1021/jm9000314
BindingDB Entry DOI: 10.7270/Q2M90706