null
SMILES: Cn1cc2NC(=O)c3cccc(Cn4nc(ccc4=O)-c4cncc(CNC(=O)c2n1)c4)c3
InChI Key: InChIKey=OWGPCYDHMUISML-UHFFFAOYSA-N
Activity Spreadsheet -- Enzyme Inhibition Constant Data from BindingDB
Found 4 hits for monomerid = 318826
Trg + Lig
Ki
nM
ΔG°
kcal/mole
IC50
nM
Kd
nM
EC50/IC50
nM
koff
s-1
kon
M-1s-1
pHTemp
°C
Interleukin-1 receptor-associated kinase 4
(Homo sapiens (Human))
BDBM318826
(US10517872, Compound 3 | US9624246, Compound 3)
Show SMILES Cn1cc2NC(=O)c3cccc(Cn4nc(ccc4=O)-c4cncc(CNC(=O)c2n1)c4)c3
Show InChI InChI=1S/C23H19N7O3/c1-29-13-19-21(28-29)23(33)25-10-15-8-17(11-24-9-15)18-5-6-20(31)30(27-18)12-14-3-2-4-16(7-14)22(32)26-19/h2-9,11,13H,10,12H2,1H3,(H,25,33)(H,26,32)
Reactome pathway
US Patent
n/an/a 550n/an/an/an/an/an/a
Merck Patent GmbH
US Patent
Assay Description
IRAK4 is a human purified recombinant enzyme (His-TEV-IRAK4 (1-460)). In this assay, IRAK4 hydrolyses ATP, autophosphorylates and phosphorylates a Se...
US Patent US9624246 (2017)
BindingDB Entry DOI: 10.7270/Q2DF6T92
Interleukin-1 receptor-associated kinase 4
(Homo sapiens (Human))
BDBM318826
(US10517872, Compound 3 | US9624246, Compound 3)
Show SMILES Cn1cc2NC(=O)c3cccc(Cn4nc(ccc4=O)-c4cncc(CNC(=O)c2n1)c4)c3
Show InChI InChI=1S/C23H19N7O3/c1-29-13-19-21(28-29)23(33)25-10-15-8-17(11-24-9-15)18-5-6-20(31)30(27-18)12-14-3-2-4-16(7-14)22(32)26-19/h2-9,11,13H,10,12H2,1H3,(H,25,33)(H,26,32)
Reactome pathway
US Patent
n/an/a<100n/an/an/an/an/an/a
Merck Patent GmbH
US Patent
Assay Description
IRAK4 is a human purified recombinant enzyme (His-TEV-IRAK4 (1-460)).In this assay, IRAK4 hydrolyses ATP, autophosphorylates and phosphorylates a Ser...
US Patent US10517872 (2019)
BindingDB Entry DOI: 10.7270/Q2SN0CCS
Interleukin-1 receptor-associated kinase 1 [194-712]
(Homo sapiens (Human))
BDBM318826
(US10517872, Compound 3 | US9624246, Compound 3)
Show SMILES Cn1cc2NC(=O)c3cccc(Cn4nc(ccc4=O)-c4cncc(CNC(=O)c2n1)c4)c3
Show InChI InChI=1S/C23H19N7O3/c1-29-13-19-21(28-29)23(33)25-10-15-8-17(11-24-9-15)18-5-6-20(31)30(27-18)12-14-3-2-4-16(7-14)22(32)26-19/h2-9,11,13H,10,12H2,1H3,(H,25,33)(H,26,32)
US Patent
n/an/a 550n/an/an/an/an/an/a
Merck Patent GmbH
US Patent
Assay Description
IRAK1 is a human purified recombinant enzyme (His-TEV-IRAK1 (194-712))In this assay, IRAK1 hydrolyses ATP and autophosphorylates. Measurement of IRAK...
US Patent US10517872 (2019)
BindingDB Entry DOI: 10.7270/Q2SN0CCS
Interleukin-1 receptor-associated kinase 1 [194-712]
(Homo sapiens (Human))
BDBM318826
(US10517872, Compound 3 | US9624246, Compound 3)
Show SMILES Cn1cc2NC(=O)c3cccc(Cn4nc(ccc4=O)-c4cncc(CNC(=O)c2n1)c4)c3
Show InChI InChI=1S/C23H19N7O3/c1-29-13-19-21(28-29)23(33)25-10-15-8-17(11-24-9-15)18-5-6-20(31)30(27-18)12-14-3-2-4-16(7-14)22(32)26-19/h2-9,11,13H,10,12H2,1H3,(H,25,33)(H,26,32)
US Patent
n/an/a<100n/an/an/an/an/an/a
Merck Patent GmbH
US Patent
Assay Description
IRAK1 is a human purified recombinant enzyme (His-TEV-IRAK1 (194-712)) In this assay, IRAK1 hydrolyses ATP and autophosphorylates. Measurement of IRA...
US Patent US9624246 (2017)
BindingDB Entry DOI: 10.7270/Q2DF6T92